{"text_format":"1","workbook":"xlsx","n_sheets":3,"sheets":["Programm","Standard","Extra"],"not_rendered":{"charts":2,"images":2,"macros":1,"external_links":0,"defined_names":19,"comments":0,"pivot_tables":0},"unopened":[],"bounds":{"document_bytes":16777216,"sheet_cells":100000,"rows_first":2000,"rows_last":500,"rows_between":2000,"halvings":0,"cell_chars":16384,"cell_head_chars":4096},"cells_cut":0,"cells_raw":0,"read":"whole","date_system":"1900"}

{"sheet":"Programm","index":0,"n_rows":196,"n_cols":69,"rows_kept":196,"cut":false,"hidden":false,"merged":[[89,29,89,41],[31,61,31,63],[30,57,30,59],[26,61,26,63],[34,59,34,60],[49,57,49,59],[51,57,51,59],[2,29,2,41],[89,13,89,16],[89,17,89,20],[89,21,89,24],[89,25,89,28],[28,57,28,59],[31,57,31,59],[29,57,29,59],[30,61,30,63],[26,34,26,37],[27,34,27,37],[28,34,28,37],[29,34,29,37],[30,34,30,37],[31,34,31,37],[26,30,26,33],[143,35,143,38],[143,39,143,41],[141,1,141,6],[141,7,141,9],[141,10,141,16],[141,17,141,18],[141,28,141,30],[141,32,141,34],[141,35,141,38],[141,39,141,41],[142,1,142,6],[142,28,142,30],[142,32,142,34],[142,35,142,38],[142,39,142,41],[142,7,142,18],[143,1,143,6],[143,7,143,11],[143,12,143,15],[143,16,143,19],[143,20,143,23],[143,24,143,27],[143,32,143,34],[139,1,139,6],[139,7,139,9],[139,10,139,16],[139,17,139,18],[139,28,139,30],[139,31,139,35],[139,36,139,38],[139,39,139,41],[140,1,140,6],[140,7,140,9],[140,10,140,16],[140,17,140,18],[140,28,140,30],[140,32,140,34],[140,35,140,38],[140,39,140,41],[137,1,137,6],[137,7,137,9],[137,10,137,16],[137,17,137,18],[137,28,137,41],[138,1,138,6],[138,7,138,9],[138,10,138,16],[138,17,138,18],[138,28,138,30],[138,31,138,35],[138,36,138,38],[138,39,138,41],[135,1,135,8],[135,9,135,12],[135,13,135,16],[135,17,135,20],[135,21,135,24],[135,25,135,28],[135,29,135,41],[136,1,136,18],[136,28,136,41],[130,38,130,41],[131,38,131,41],[132,38,132,41],[133,38,133,41],[134,38,134,41],[107,26,107,29],[107,30,107,33],[107,34,107,37],[107,38,107,41],[108,26,108,29],[108,30,108,33],[108,34,108,37],[108,38,108,41],[132,34,132,37],[133,34,133,37],[134,34,134,37],[109,38,109,41],[110,38,110,41],[111,38,111,41],[112,38,112,41],[113,38,113,41],[114,38,114,41],[115,38,115,41],[116,38,116,41],[117,38,117,41],[118,38,118,41],[119,38,119,41],[120,38,120,41],[121,38,121,41],[122,38,122,41],[123,38,123,41],[124,38,124,41],[125,38,125,41],[126,38,126,41],[127,38,127,41],[128,38,128,41],[129,38,129,41],[134,30,134,33],[109,34,109,37],[110,34,110,37],[111,34,111,37],[112,34,112,37],[113,34,113,37],[114,34,114,37],[115,34,115,37],[116,34,116,37],[117,34,117,37],[118,34,118,37],[119,34,119,37],[120,34,120,37],[121,34,121,37],[122,34,122,37],[123,34,123,37],[124,34,124,37],[125,34,125,37],[126,34,126,37],[127,34,127,37],[128,34,128,37],[129,34,129,37],[130,34,130,37],[131,34,131,37],[125,30,125,33],[126,30,126,33],[127,30,127,33],[128,30,128,33],[129,30,129,33],[130,30,130,33],[131,30,131,33],[132,30,132,33],[133,30,133,33],[127,26,127,29],[128,26,128,29],[129,26,129,29],[130,26,130,29],[131,26,131,29],[132,26,132,29],[133,26,133,29],[134,26,134,29],[109,30,109,33],[110,30,110,33],[111,30,111,33],[112,30,112,33],[113,30,113,33],[114,30,114,33],[115,30,115,33],[116,30,116,33],[117,30,117,33],[118,30,118,33],[119,30,119,33],[120,30,120,33],[121,30,121,33],[122,30,122,33],[123,30,123,33],[124,30,124,33],[118,26,118,29],[119,26,119,29],[120,26,120,29],[121,26,121,29],[122,26,122,29],[123,26,123,29],[124,26,124,29],[125,26,125,29],[126,26,126,29],[109,26,109,29],[110,26,110,29],[111,26,111,29],[112,26,112,29],[113,26,113,29],[114,26,114,29],[115,26,115,29],[116,26,116,29],[117,26,117,29],[126,23,126,25],[127,23,127,25],[128,23,128,25],[129,23,129,25],[130,23,130,25],[131,23,131,25],[132,23,132,25],[133,23,133,25],[134,23,134,25],[117,23,117,25],[118,23,118,25],[119,23,119,25],[120,23,120,25],[121,23,121,25],[122,23,122,25],[123,23,123,25],[124,23,124,25],[125,23,125,25],[114,23,114,25],[115,23,115,25],[116,23,116,25],[108,13,108,25],[107,13,107,16],[107,17,107,19],[109,20,109,22],[110,20,110,22],[111,20,111,22],[112,20,112,22],[113,20,113,22],[114,20,114,22],[115,20,115,22],[116,20,116,22],[109,23,109,25],[109,13,109,16],[110,13,110,16],[111,13,111,16],[107,20,107,22],[126,20,126,22],[127,20,127,22],[128,20,128,22],[129,20,129,22],[130,20,130,22],[131,20,131,22],[132,20,132,22],[133,20,133,22],[134,20,134,22],[117,20,117,22],[118,20,118,22],[119,20,119,22],[120,20,120,22],[121,20,121,22],[122,20,122,22],[123,20,123,22],[124,20,124,22],[125,20,125,22],[121,13,121,16],[122,13,122,16],[126,17,126,19],[127,17,127,19],[128,17,128,19],[129,17,129,19],[114,17,114,19],[115,17,115,19],[116,17,116,19],[117,17,117,19],[118,17,118,19],[119,17,119,19],[120,17,120,19],[121,17,121,19],[122,17,122,19],[114,13,114,16],[115,13,115,16],[116,13,116,16],[117,13,117,16],[118,13,118,16],[119,13,119,16],[120,13,120,16],[123,17,123,19],[128,9,128,12],[129,9,129,12],[130,9,130,12],[131,9,131,12],[132,9,132,12],[133,9,133,12],[134,9,134,12],[134,13,134,16],[124,17,124,19],[125,17,125,19],[130,17,130,19],[131,17,131,19],[132,17,132,19],[133,17,133,19],[134,17,134,19],[123,13,123,16],[124,13,124,16],[125,13,125,16],[126,13,126,16],[127,13,127,16],[128,13,128,16],[129,13,129,16],[132,13,132,16],[133,13,133,16],[130,13,130,16],[131,13,131,16],[130,5,130,8],[131,5,131,8],[132,5,132,8],[133,5,133,8],[134,5,134,8],[109,9,109,12],[110,9,110,12],[111,9,111,12],[112,9,112,12],[113,9,113,12],[114,9,114,12],[115,9,115,12],[116,9,116,12],[117,9,117,12],[118,9,118,12],[119,9,119,12],[120,9,120,12],[121,9,121,12],[122,9,122,12],[123,9,123,12],[124,9,124,12],[125,9,125,12],[126,9,126,12],[127,9,127,12],[132,1,132,4],[133,1,133,4],[134,1,134,4],[109,5,109,8],[110,5,110,8],[111,5,111,8],[112,5,112,8],[113,5,113,8],[114,5,114,8],[115,5,115,8],[116,5,116,8],[117,5,117,8],[118,5,118,8],[119,5,119,8],[120,5,120,8],[121,5,121,8],[122,5,122,8],[123,5,123,8],[124,5,124,8],[125,5,125,8],[126,5,126,8],[127,5,127,8],[128,5,128,8],[129,5,129,8],[123,1,123,4],[124,1,124,4],[125,1,125,4],[126,1,126,4],[127,1,127,4],[128,1,128,4],[129,1,129,4],[130,1,130,4],[131,1,131,4],[114,1,114,4],[115,1,115,4],[116,1,116,4],[117,1,117,4],[118,1,118,4],[119,1,119,4],[120,1,120,4],[121,1,121,4],[122,1,122,4],[97,20,97,23],[97,32,97,34],[97,24,97,27],[97,16,97,19],[97,1,97,6],[97,7,97,11],[97,12,97,15],[112,1,112,4],[113,1,113,4],[112,13,112,16],[113,13,113,16],[109,17,109,19],[110,17,110,19],[111,17,111,19],[112,17,112,19],[113,17,113,19],[112,23,112,25],[113,23,113,25],[107,23,107,25],[110,23,110,25],[111,23,111,25],[109,1,109,4],[110,1,110,4],[111,1,111,4],[107,1,107,4],[108,1,108,4],[107,5,107,8],[108,5,108,8],[107,9,107,12],[108,9,108,12],[19,6,19,8],[22,22,22,41],[20,12,20,16],[26,18,26,29],[21,1,21,5],[42,1,42,6],[31,27,31,29],[24,18,24,29],[33,30,33,33],[26,38,26,41],[27,38,27,41],[28,38,28,41],[29,38,29,41],[30,38,30,41],[31,38,31,41],[32,38,32,41],[33,38,33,41],[32,27,32,29],[95,7,95,9],[93,1,93,6],[94,1,94,6],[95,10,95,16],[37,13,37,22],[26,11,26,13],[28,11,28,13],[29,11,29,13],[34,1,34,12],[35,1,35,12],[30,18,30,20],[26,14,26,17],[89,1,89,8],[89,9,89,12],[20,6,20,8],[36,1,36,12],[37,1,37,12],[35,13,35,22],[34,13,34,22],[31,7,31,10],[32,7,32,10],[31,18,31,20],[32,18,32,20],[33,18,33,20],[27,21,27,23],[28,21,28,23],[29,21,29,23],[30,21,30,23],[33,1,33,3],[22,5,22,8],[22,13,22,21],[21,13,21,21],[35,23,35,29],[36,23,36,29],[37,23,37,29],[28,27,28,29],[33,27,33,29],[36,13,36,22],[32,21,32,23],[33,21,33,23],[27,24,27,26],[28,24,28,26],[29,24,29,26],[30,24,30,26],[31,24,31,26],[32,24,32,26],[33,24,33,26],[31,21,31,23],[31,11,31,13],[32,11,32,13],[33,11,33,13],[33,14,33,17],[31,14,31,17],[32,14,32,17],[25,7,25,10],[26,7,26,10],[25,11,25,13],[25,14,25,17],[25,18,25,20],[25,21,25,23],[27,18,27,20],[32,34,32,37],[33,34,33,37],[27,30,27,33],[28,30,28,33],[29,30,29,33],[27,27,27,29],[29,27,29,29],[30,27,30,29],[31,30,31,33],[32,30,32,33],[27,7,27,10],[28,7,28,10],[29,7,29,10],[30,7,30,10],[28,14,28,17],[27,14,27,17],[29,14,29,17],[30,14,30,17],[35,37,35,41],[19,17,19,19],[25,27,25,29],[25,30,25,33],[30,30,30,33],[27,11,27,13],[30,11,30,13],[2,8,2,13],[8,19,8,21],[9,19,9,21],[16,17,16,19],[16,14,16,16],[15,14,15,16],[15,17,15,19],[13,17,13,19],[14,14,14,16],[14,17,14,19],[13,14,13,16],[7,19,7,21],[13,9,13,11],[14,9,14,11],[15,9,15,11],[16,9,16,11],[12,1,12,13],[15,20,15,21],[14,20,14,21],[4,1,4,7],[4,8,4,41],[13,20,13,21],[16,20,16,21],[16,12,16,13],[15,12,15,13],[14,12,14,13],[12,14,12,21],[14,7,14,8],[1,25,1,28],[2,25,2,28],[1,14,1,24],[2,14,2,24],[1,8,1,13],[1,29,1,41],[0,1,1,7],[2,1,2,7],[3,1,3,7],[0,8,0,28],[0,29,0,41],[3,8,3,41],[13,1,13,6],[14,1,14,6],[19,1,19,2],[5,22,5,41],[20,17,20,19],[20,20,20,21],[19,12,19,16],[17,20,17,21],[20,3,20,5],[17,12,17,13],[13,12,13,13],[17,1,17,6],[18,1,18,6],[17,14,17,16],[17,17,17,19],[19,3,19,5],[17,9,17,11],[15,7,15,8],[16,7,16,8],[17,7,17,8],[15,1,15,6],[16,1,16,6],[13,7,13,8],[19,9,19,11],[30,1,30,3],[31,1,31,3],[33,7,33,10],[25,34,25,37],[92,28,92,30],[92,39,92,41],[92,36,92,38],[92,31,92,35],[25,4,25,6],[26,4,26,6],[27,4,27,6],[28,4,28,6],[29,4,29,6],[30,4,30,6],[31,4,31,6],[32,4,32,6],[26,1,26,3],[27,1,27,3],[28,1,28,3],[47,1,48,41],[39,1,40,41],[29,1,29,3],[46,1,46,41],[91,28,91,41],[20,1,20,2],[20,9,20,11],[33,4,33,6],[32,1,32,3],[25,38,25,41],[28,18,28,20],[29,18,29,20],[25,24,25,26],[22,1,22,4],[22,9,22,12],[21,9,21,12],[24,1,24,17],[23,1,23,17],[23,18,23,29],[23,30,23,41],[24,30,24,41],[53,1,53,7],[54,1,54,7],[56,1,56,7],[25,1,25,3],[36,30,36,36],[36,37,36,41],[35,30,35,36],[97,35,97,38],[94,39,94,41],[95,39,95,41],[96,39,96,41],[97,39,97,41],[93,28,93,30],[93,31,93,35],[93,36,93,38],[93,39,93,41],[94,28,94,30],[94,35,94,38],[95,35,95,38],[96,28,96,30],[94,32,94,34],[95,32,95,34],[96,32,96,34],[96,1,96,6],[96,7,96,18],[90,1,90,18],[90,28,90,41],[91,7,91,9],[92,7,92,9],[38,1,38,41],[41,1,41,41],[95,1,95,6],[95,17,95,18],[92,10,92,16],[91,10,91,16],[95,28,95,30],[96,35,96,38],[94,17,94,18],[91,1,91,6],[92,1,92,6],[91,17,91,18],[92,17,92,18],[93,7,93,9],[94,7,94,9],[94,10,94,16],[93,10,93,16],[93,17,93,18],[54,8,54,41],[55,8,55,41],[55,1,55,7],[51,8,51,28],[51,29,51,41],[52,8,52,13],[52,14,52,24],[52,25,52,28],[52,29,52,41],[53,8,53,13],[53,14,53,24],[53,25,53,28],[53,29,53,41],[102,1,102,7],[103,1,103,7],[101,1,101,7],[105,1,105,12],[106,1,106,12],[99,8,99,28],[99,29,99,41],[100,8,100,13],[100,14,100,24],[100,25,100,28],[100,29,100,41],[101,8,101,13],[101,14,101,24],[101,25,101,28],[101,29,101,41],[102,8,102,41],[103,8,103,41],[105,26,105,41],[106,26,106,41],[105,13,105,25],[106,13,106,25]]}
[null,null,null,null,null,null,null,null,{"$f":"$BN$2","v":"Berechnung von Tellerfedern"},null,null,null,null,null,null,null,null,null,null,null,null,null,null,null,null,null,null,null,null,{"$f":"IF($AT$4<1.25,$BN$3,IF($AT$4=$AT$5,$BN$108,$BN$94))","v":"Gruppe 1"},null,null,null,null,null,null,null,null,null,null,null,null,{"$f":"BN58","v":"Sprache"},null,"De",{"$f":"$J$14*$AT$51","v":8},"E",{"$f":"$AS$99","v":206000},"mue",0.3,"C1N",{"$f":"(0.25*$AT$6/$AT$4-1+0.75)*(5/8*$AT$6/$AT$4-1+3/8)","v":0.10850694444444449},null,"Lebensdauer nach diskreter Wöhlerlinie",null,null,null,"Lebensdauer nach genäherter Wöhlerlinie",null,null,null,null,null,null,null,"Sprachblock","Deutsch","Englisch","Französisch"]
[null,null,null,null,null,null,null,null,{"$f":"$BN$4","v":"Teile/Zeichn. Nr.:"},null,null,null,null,null,"17 0001",null,null,null,null,null,null,null,null,null,null,{"$f":"$BN$174","v":"Revision"},null,null,null,null,null,null,null,null,null,null,null,null,null,null,null,null,1,null,"Di",{"$f":"$J$15*$AT$51","v":3.2},"Delta",{"$f":"$AT$1/$AT$2","v":2.5},"ho/t",{"$f":"$AV$6/$AT$5","v":0.83333333333333359},"C1",{"$f":"1/$AZ$1","v":9.2159999999999958},"Maximale Oberspannung",{"$f":"AND(($AT$5<=0.6),($AT$5>0))*1300+AND(($AT$5<=1.25),($AT$5>0.6))*1300+AND(($AT$5<=3),($AT$5>1.25))*1290+AND(($AT$5<=6),($AT$5>3))*1278+AND(($AT$5<=10),($AT$5>6))*1264+AND(($AT$5<=16),($AT$5>10))*1248","v":1300},"NE2",{"$f":"($BB$6-$BB$4)/$BB$3","v":6.9227819320422999},"Maximale Oberspannung",{"$f":"$AY$25+$AY$26*$AT$5+$AY$27*$AT$5*$AT$5","v":1301.3482864730286},"NE2",{"$f":"($BB$6-$BF$4)/$BF$3","v":6.9216511512527319},null,null,null,null,null,{"$f":"IF($AQ$2=1,BO2,IF($AQ$2=2,BP2,IF($AQ$2=3,BQ2,\"Wrong language selection\")))","v":"Berechnung von Tellerfedern"},"Berechnung von Tellerfedern","Disc Springs, Data Sheet","Calcul des Rondelles Ressorts"]
[null,"K-Version 10.03.22",null,null,null,null,null,null,{"$f":"$BN$5","v":"Projekt:"},null,null,null,null,null,null,null,null,null,null,null,null,null,null,null,null,{"$f":"$BN$175","v":"Kunde"},null,null,null,null,null,null,null,null,null,null,null,null,null,null,null,null,"1 = Deutsch",null,null,null,"K1",{"$f":"(($AV$2-1)/$AV$2)^2/(($AV$2+1)/($AV$2-1)-2/LN($AV$2))/$AV$5","v":0.76079910343609702},"K2",{"$f":"6/$AV$5*((($AV$2-1)/LN($AV$2)-1)/LN($AV$2))","v":1.3277960710375436},"C2",{"$f":"AZ2*(5/32*($AT$6/$AT$4-1)^2+1)","v":10.215999999999996},"M",{"$f":"AND(($AT$5<=0.6),($AT$5>0))*-161.41+AND(($AT$5<=1.25),($AT$5>0.6))*-159.87+AND(($AT$5<=3),($AT$5>1.25))*-154.49+AND(($AT$5<=6),($AT$5>3))*-146.04+AND(($AT$5<=10),($AT$5>6))*-133.74+AND(($AT$5<=16),($AT$5>10))*-115.29","v":-161.41},"NE3",{"$f":"($BB$7-$BB$4)/$BB$3","v":6.770836747686344},"M",{"$f":"$BB$25+$BB$26*$AT$5+$BB$27*$AT$5*$AT$5","v":-161.58822525409755},"NE3",{"$f":"($BB$7-$BF$4)/$BF$3","v":6.769873556268144},null,null,null,null,null,"Gruppe 1","Gruppe 1","group 1","Groupe 1"]
[null,{"$f":"NOW()","v":"2022-03-10T14:18:38.430"},null,null,null,null,null,null,"Mubea Tellerfedern GmbH, Postfach 120, 57564 Daaden",null,null,null,null,null,null,null,null,null,null,null,null,null,null,null,null,null,null,null,null,null,null,null,null,null,null,null,null,null,null,null,null,null,"2 = Englisch",null,"t",{"$f":"$J$16*$AT$51","v":0.3},"K_eins",1,"K3",{"$f":"3/$AV$5*($AV$2-1)/LN($AV$2)","v":1.5632532754066812},"E_20°",{"$f":"AZ99","v":206000},"B",{"$f":"AND(($AT$5<=0.6),($AT$5>0))*1907.05+AND(($AT$5<=1.25),($AT$5>0.6))*1886.37+AND(($AT$5<=3),($AT$5>1.25))*1825.46+AND(($AT$5<=6),($AT$5>3))*1725.19+AND(($AT$5<=10),($AT$5>6))*1585.7+AND(($AT$5<=16),($AT$5>10))*1376.47","v":1907.05},"N2",{"$f":"10^BD2","v":8371088.474629052},"B",{"$f":"$BE$25+$BE$26*$AT$5+$BE$27*$AT$5*$AT$5","v":1908.1010937079625},"N2",{"$f":"10^BH2","v":8349320.8632738944},null,null,null,null,null,"Teile/Zeichn. Nr.:","Teile/Zeichn. Nr.:","part./drawing no.:","Pièce/ Plan n°:"]
[null,null,null,null,null,null,null,null,{"$f":"$BN$107","v":"Tel.: Vertrieb: +49 2743/806- 3588, -3593, -3625; Entwicklung: +49 2743/806-3510"},null,null,null,null,null,null,null,null,null,null,null,null,null,null,null,null,null,null,null,null,null,null,null,null,null,null,null,null,null,null,null,null,null,"3 = France",null,"t'",{"$f":"$J$17*$AT$51","v":0.3},"pi",{"$f":"4*ATAN(1)","v":3.1415926535897931},"4e/(1-mue**2)",{"$f":"4*$AV$1/(1-$AX$1*$AX$1)","v":905494.50549450552},"E_rechn",{"$f":"$AS$99","v":206000},"Korrektur für Säule",{"$f":"AND($J$23=1,$B$23<=10)*1+AND($J$23=1,$B$23>10)*(0.004*$B$23+0.96)+($J$23<>1)*(0.007143*$B$23+1.092857)","v":1},"N3",{"$f":"10^BD3","v":5899792.6389572406},null,null,"N3",{"$f":"10^BH3","v":5886722.3998044841},null,null,null,null,null,"Projekt:","Projekt:","project:","Projet:"]
[null,null,null,null,null,null,null,null,null,null,null,null,null,null,null,null,null,null,null,null,null,null,{"$f":"IF(OR($J$23>1,$B$23>1),BN7,BN6)","v":"Kennlinie der Tellerfeder"},null,null,null,null,null,null,null,null,null,null,null,null,null,null,null,null,null,null,null,{"$f":"BN150","v":"Einheiten"},null,"L0",{"$f":"$J$18*$AT$51","v":0.55000000000000004},"h0",{"$f":"AT6-AT5","v":0.25000000000000006},null,null,null,null,"Schwellspannung 2",{"$f":"$BB$5*($BB$9-$BB$8/SQRT(3))","v":789.64376834905227},"N",{"$f":"MIN(BD4:BD5)","v":5899792.6389572406},null,null,"N",{"$f":"MIN(BH4:BH5)","v":5886722.3998044841},null,null,null,null,null,"Kennlinie der Tellerfeder","Kennlinie der Tellerfeder","characteristic of spring","Caractéristique de la rondelle ressort"]
[null,null,null,null,null,null,null,null,null,null,null,null,null,null,null,null,null,null,null,null,null,null,null,null,null,null,null,null,null,null,null,null,null,null,null,null,null,null,null,null,null,null,1,null,null,null,null,null,null,null,null,null,"Schwellspannung 3",{"$f":"$BB$5*($BB$11-$BB$10/SQRT(3))","v":814.16924055594723},null,null,null,null,null,null,null,null,null,null,null,"Kennlinie der Federsäule","Kennlinie der Federsäule","characteristic of stack","Caractéristique de l'empilage"]
[null,null,null,null,null,null,null,null,null,null,null,null,null,null,null,null,null,null,null,{"$f":"BN56","v":"Feder-"},null,null,null,null,null,null,null,null,null,null,null,null,null,null,null,null,null,null,null,null,null,null,"1 = mm N s",null,null,"Näherung der Blockspannung",null,null,null,"Reduktion",null,null,"Sigma II 1",{"$f":"MIN(INDEX($V$28:$X$34,$AQ$41+1,1),INDEX($V$28:$X$34,$AQ$42+1,1))*$BB$12","v":205.45067070542956},"s1/ho",{"$f":"IF($AQ$41=0,$E$28,IF($AQ$41=1,$E$29,IF($AQ$41=2,$E$30,IF($AQ$41=3,$E$31,IF($AQ$41=4,$E$32,IF($AQ$41=5,$E$33,IF(OR($AQ$41=\"c\",$AQ$41=\"C\"),$E$34)))))))","v":0.24799999999999994},null,null,null,null,null,null,null,null,null,"Tellerfederabmessung","Tellerfederabmessung","dimensions","Dimensions"]
[null,null,null,null,null,null,null,null,null,null,null,null,null,null,null,null,null,null,null,{"$f":"BN57","v":"kraft"},null,null,null,null,null,null,null,null,null,null,null,null,null,null,null,null,null,null,null,null,null,null,"2 = in lbf s",null,"de/di","Sigma_1_max","Sigma_1_näher","Fehler",null,"t/t'",{"$f":"$AT$5/$AT$4","v":1},null,"Sigma II 2",{"$f":"MAX(INDEX(V28:X34,AQ41+1,1),INDEX(V28:X34,AQ42+1,1))*BB12","v":908.26076838602114},"s2/ho",{"$f":"IF($AQ$42=0,$E$28,IF($AQ$42=1,$E$29,IF($AQ$42=2,$E$30,IF($AQ$42=3,$E$31,IF($AQ$42=4,$E$32,IF($AQ$42=5,$E$33,IF(OR($AQ$42=\"c\",$AQ$42=\"C\"),$E$34)))))))","v":0.74799999999999989},null,null,null,null,null,null,null,null,null,"Außendurchm.:","Außendurchm.:","outer diam.:","Diam. extérieur:"]
[null,null,null,null,null,null,null,null,null,null,null,null,null,null,null,null,null,null,null,{"$f":"BN96","v":"in N"},null,null,null,null,null,null,null,null,null,null,null,null,null,null,null,null,null,null,null,null,null,null,{"$f":"$BN$59","v":"Diagramm-"},null,1.5,-2600,{"$f":"$AT$15+$AT$16*AS10+$AT$17*AS10*AS10","v":-2599.998740898026},{"$f":"(AT10-AU10)^2","v":1.5853377810023489E-6},null,"c1",{"$f":"($AY$9^2)/(($AT$6/(4*$AT$4)-$AY$9+0.75)*(5*$AT$6/8/$AT$4-$AY$9+3/8))","v":9.2159999999999958},null,"Sigma III 1",{"$f":"MIN(INDEX($Y$28:$AA$34,$AQ$41+1,1),INDEX($Y$28:$AA$34,$AQ$42+1,1))*$BB$12","v":397.96490109633561},null,null,null,null,null,null,null,null,null,null,null,"Innendurchm.:","Innendurchm.:","inner diam.:","Diam. intérieur:"]
[null,null,null,null,null,null,null,null,null,null,null,null,null,null,null,null,null,null,null,null,null,null,null,null,null,null,null,null,null,null,null,null,null,null,null,null,null,null,null,null,null,null,{"$f":"$BN$60","v":"steuerung"},null,2,-3400,{"$f":"$AT$15+$AT$16*AS11+$AT$17*AS11*AS11","v":-3400.0013307566505},{"$f":"(AT11-AU11)^2","v":1.7709132629347194E-6},null,"c2",{"$f":"(5/32*($AT$6/$AT$4-1)^2+1)*$AY$10/($AY$9^3)","v":10.215999999999996},null,"Sigma III 2",{"$f":"MAX(INDEX(Y28:AA34,AQ41+1,1),INDEX(Y28:AA34,AQ42+1,1))*BB12","v":1043.9343833319394},null,null,null,null,null,null,null,null,null,null,null,"Blechdicke:","Blechdicke:","thickness:","Epaisseur:"]
[null,null,null,null,null,null,null,null,null,null,null,null,null,null,null,null,null,null,null,null,null,null,null,null,null,null,null,null,null,null,null,null,null,null,null,null,null,null,null,null,null,null,{"$f":"$BN$61","v":"Federweg"},null,2.5,-3600,{"$f":"$AT$15+$AT$16*AS12+$AT$17*AS12*AS12","v":-3600.0013783428521},{"$f":"(AT12-AU12)^2","v":1.899829018070838E-6},null,"eta",{"$f":"SQRT(-$AY$10/2+SQRT(($AY$10/2)^2+$AY$11))","v":1},null,"Kor. f. T. u. Einh.",{"$f":"$AZ$4/$AZ$5/$AT$56","v":1},null,null,null,null,null,null,null,null,null,null,null,"Kennwerte","Kennwerte","data","Données"]
[null,{"$f":"BN8","v":"Tellerfederabmessung"},null,null,null,null,null,null,null,null,null,null,null,null,{"$f":"$BN$193","v":"DIN-Toleranzen"},null,null,null,null,null,null,null,null,null,null,null,null,null,null,null,null,null,null,null,null,null,null,null,null,null,null,null,{"$f":"$BN$62","v":"von"},null,null,null,null,null,null,"H",{"$f":"($AT$6-$AT$5)*$AY$12","v":0.25000000000000006},null,"Dauer ganzzahlig",{"$f":"IF($BD$6<10000,INT($BD$6/100)*100,IF($BD$6<100000,INT($BD$6/1000)*1000,IF($BD$6<1000000,INT($BD$6/10000)*10000,IF($BD$6<2000000,INT($BD$6/100000)*100000,BN71))))","v":"größer als 2 Mio."},null,null,"Dauer ganzzahlig",{"$f":"IF($BH$6<10000,INT($BH$6/100)*100,IF($BH$6<100000,INT($BH$6/1000)*1000,IF($BH$6<1000000,INT($BH$6/10000)*10000,IF($BH$6<2000000,INT($BH$6/100000)*100000,BN71))))","v":"größer als 2 Mio."},null,null,null,null,null,null,null,"Federsäule:","Federsäule:","stack:","Empilage:"]
[null,{"$f":"BN9","v":"Außendurchm.:"},null,null,null,null,null,"De=",null,8,null,null,{"$f":"$AT$53","v":" mm"},null,{"$f":"$AS$47/$AT$51","v":7.85},null,null,{"$f":"$J$14","v":8},null,null,{"$f":"$AT$53","v":" mm"},null,null,null,null,null,null,null,null,null,null,null,null,null,null,null,null,null,null,null,null,null,null,null,null,null,null,{"$f":"SUM(AV10:AV13)","v":5.2560800620079065E-6},null,null,null,null,"Dauer gerundet",{"$f":"IF($BD$6<10000,ROUND($BD$6,-1),IF($BD$6<100000,ROUND($BD$6,-2),IF($BD$6<1000000,ROUND($BD$6,-3),IF($BD$6<2000000,ROUND($BD$6,-4),BN71))))","v":"größer als 2 Mio."},null,null,"Dauer gerundet",{"$f":"IF($BH$6<10000,ROUND($BH$6,-1),IF($BH$6<100000,ROUND($BH$6,-2),IF($BH$6<1000000,ROUND($BH$6,-3),IF($BH$6<2000000,ROUND($BH$6,-4),BN71))))","v":"größer als 2 Mio."},null,null,null,null,null,null,null,"Federn zu","Federn zu","springs as","Rond. Ressort"]
[null,{"$f":"BN10","v":"Innendurchm.:"},null,null,null,null,null,"Di=",null,3.2,null,null,{"$f":"$AT$53","v":" mm"},null,{"$f":"J15","v":3.2},null,null,{"$f":"$AS$46/$AT$51","v":3.3200000000000003},null,null,{"$f":"$AT$53","v":" mm"},null,null,null,null,null,null,null,null,null,null,null,null,null,null,null,null,null,null,null,null,null,{"$f":"BN63","v":"bis"},null,"a0",3400.0242823123926,null,null,null,null,null,null,null,null,null,null,null,null,null,null,null,null,null,null,null,"Feder","Feder","spring","R. Res."]
[null,{"$f":"BN11","v":"Blechdicke:"},null,null,null,null,null,"t=",null,0.3,null,null,{"$f":"$AT$53","v":" mm"},null,{"$f":"IF(AND(AT99<>13,AT99<>14),IF(J16=J17,$AR$142/$AT$51,\"\"),\"\")","v":0.24},null,null,{"$f":"IF(AND(AT99<>13,AT99<>14),IF(J16=J17,$AS$142/$AT$51,\"\"),\"\")","v":0.32},null,null,{"$f":"IF(O16<>\"\",$AT$53,\"\")","v":" mm"},null,null,null,null,null,null,null,null,null,null,null,null,null,null,null,null,null,null,null,null,null,null,null,"a1",-5800.0229756242179,"x",null,null,null,null,null,null,"Näherung der Wöhlerlinie",null,null,null,null,null,null,null,null,null,null,null,"Federn","Federn","springs","R. Res."]
[null,{"$f":"BN73","v":"red. Blechdicke:"},null,null,null,null,null,"t'=",null,{"$f":"J16","v":0.3},null,null,{"$f":"$AT$53","v":" mm"},null,{"$f":"IF(AND(AT99<>13,AT99<>14),IF(J16<>J17,$AR$142/$AT$51,\"\"),\"\")","v":""},null,null,{"$f":"IF(AND(AT99<>13,AT99<>14),IF(J16<>J17,$AS$142/$AT$51,\"\"),\"\")","v":""},null,null,{"$f":"IF(O17<>\"\",$AT$53,\"\")","v":""},null,null,null,null,null,null,null,null,null,null,null,null,null,null,null,null,null,null,null,null,null,null,null,"a2",1200.0050845448479,"x*x",null,null,"t","Sigma_max","Sigma_näher","Fehler","M","M_näher","Fehler","B","B_näher","Fehler",null,null,null,null,null,null,"Paketen","Paketen","packets","Paquets"]
[null,{"$f":"BN72","v":"Federhöhe:"},null,null,null,null,null,"l0=",null,0.55000000000000004,null,null,{"$f":"$AT$53","v":" mm"},null,{"$f":"$AR$143/$AT$51","v":0.5},null,null,{"$f":"$AS$143/$AT$51","v":0.65},null,null,{"$f":"$AT$53","v":" mm"},null,null,null,null,null,null,null,null,null,null,null,null,null,null,null,null,null,null,null,null,null,null,null,null,null,null,null,null,0.3,1300,{"$f":"$AY$25+$AY$26*AX18+$AY$27*AX18*AX18","v":1301.3482864730286},{"$f":"(AY18-AZ18)^2","v":1.8178764133518088},-161.41,{"$f":"$BB$25+$BB$26*AX18+$BB$27*AX18*AX18","v":-161.58822525409755},{"$f":"(BB18-BC18)^2","v":3.1764241198137991E-2},1907.05,{"$f":"$BE$25+$BE$26*AX18+$BE$27*AX18*AX18","v":1908.1010937079625},{"$f":"(BE18-BF18)^2","v":1.1047979829184338},null,null,null,null,null,null,"Paket","Paket","packet","Paquet"]
[null,{"$f":"BN12","v":"Kennwerte"},null,null,null,null,null,null,null,null,null,null,null,null,null,null,null,null,null,null,null,null,null,null,null,null,null,null,null,null,null,null,null,null,null,null,null,null,null,null,null,null,null,null,"Kürzel:","Telefon.","Entwickler:","Index",null,0.92500000000000004,1300,1297.6366912573701,5.5852282129909048,-159.87,-159.29624747083375,0.32919196472467593,1886.37,1881.0800379072152,27.983698943098688,null,null,null,null,null,null,"fach geschichtet","fach geschichtet","times stacked","RR en parallèle"]
[null,"h0=",null,{"$f":"$J$18-$J$16","v":0.25000000000000006},null,null,"h0/t=",null,null,{"$f":"$D$20/$J$16","v":0.83333333333333359},null,null,"De/Di=",null,null,null,null,{"$f":"$J$14/$J$15","v":2.5},null,null,null,null,null,null,null,null,null,null,null,null,null,null,null,null,null,null,null,null,null,null,null,null,null,null,"-",3510,"Weib",1,null,2.125,1290,1290.8271806968985,0.68422790532147937,-154.49,-154.90058776460418,0.16858231244265207,1825.46,1829.4633891960157,16.027125054774693,null,null,null,null,null,null,"fach wechselsinnig","fach wechselsinnig","times against e.o.","En opposition"]
[null,"h0'=",null,{"$f":"$J$18-$J$17","v":0.25000000000000006},null,null,"h0'/t'=",null,null,{"$f":"$D$21/$J$17","v":0.83333333333333359},null,null,"(De-Di)/2=",null,null,null,null,{"$f":"($J$14-$J$15)/2","v":2.4},null,null,{"$f":"$AT$53","v":" mm"},null,null,null,null,null,null,null,null,null,null,null,null,null,null,null,null,null,null,null,null,null,null,null,"KDD",3034,"Kuras",2,null,4.5,1278,1278.5780721433021,0.33416740286182778,-146.04,-146.21998780587012,3.2395610261942431E-2,1725.19,1728.3281069780458,9.8477154056591054,null,null,null,null,null,null,"Lastpunkte","Lastpunkte","load points","Points de charge"]
[null,{"$f":"IF($J$23*$B$23>1,$BN$13,\" \")","v":" "},null,null,null,null,null,null,null,{"$f":"IF($J$23=1,\" \",$B$23*$J$23)","v":" "},null,null,null,{"$f":"IF($J$23=1,\" \",IF($J$22>1,BN14,\" \"))","v":" "},null,null,null,null,null,null,null,null,null,null,null,null,null,null,null,null,null,null,null,null,null,null,null,null,null,null,null,null,null,null,"TRR",3109,"Treude",3,null,8,1264,1263.5008265189142,0.24917416421930616,-133.74,-133.47388551879271,7.0816917108228405E-2,1585.7,1581.7633251538159,15.497408844578864,null,null,null,null,null,null,"der Einzelfeder","der Einzelfeder","of one spring","d'une rondelle ressort"]
[null,1,null,null,null,{"$f":"IF($J$23=1,IF($B$23=1,BN15,BN16),IF($B$23>1,BN17,BN18))","v":"Feder"},null,null,null,1,null,null,null,{"$f":"IF($J$23*$B$23=1,\" \",IF($J$22>1,IF($J$23>1,BN19,BN20),\" \"))","v":" "},null,null,null,null,null,null,null,null,{"$f":"BN55","v":"Federweg in  mm"},null,null,null,null,null,null,null,null,null,null,null,null,null,null,null,null,null,null,null,null,null,"GM",3013,"Gaumann",4,null,13,1248,1248.1089228183232,1.1864180351470587E-2,-115.29,-115.36098970078847,5.0395376180349689E-3,1376.47,1377.5040531286556,1.0692658728824644,null,null,null,null,null,null,"Last-","Last-","load-","Point"]
[null,{"$f":"$BN$21","v":"Lastpunkte"},null,null,null,null,null,null,null,null,null,null,null,null,null,null,null,null,{"$f":"$BN$29","v":"rechnerische"},null,null,null,null,null,null,null,null,null,null,null,{"$f":"$BN$21","v":"Lastpunkte"},null,null,null,null,null,null,null,null,null,null,null,{"$f":"BN95","v":"Berechnungen"},null,"SV",3361,"Schütz",5,null,null,null,null,{"$f":"SUM(BA18:BA23)","v":8.6825382790967982},null,null,{"$f":"SUM(BD18:BD23)","v":0.63779058335367189},null,null,{"$f":"SUM(BG18:BG23)","v":71.530012103912256},null,null,null,null,null,null,"punkt","punkt","point","charge"]
[null,{"$f":"$BN$22","v":"der Einzelfeder"},null,null,null,null,null,null,null,null,null,null,null,null,null,null,null,null,{"$f":"$BN$30","v":"Randspannungen"},null,null,null,null,null,null,null,null,null,null,null,{"$f":"IF(($J$23*$B$23)>1,$BN$32,$BN$33)","v":"der Einzelfeder"},null,null,null,null,null,null,null,null,null,null,null,{"$f":"BN66","v":"Weg"},null,"HL",3098,"Heuel",6,null,"a0",1303.1699885922399,null,null,-162.68900024962775,null,null,1921.1046244709878,null,null,null,null,null,null,null,null,"Höhe l","Höhe l","height l","Hauteur"]
[null,{"$f":"$BN$23","v":"Last-"},null,null,"s/h0'",null,null,{"$f":"$BN$25","v":"Höhe l"},null,null,null,{"$f":"$BN$26","v":"Weg s"},null,null,{"$f":"$BN$27","v":"Kraft F"},null,null,null,"σI",null,null,"σII",null,null,"σIII",null,null,"σOM",null,null,{"$f":"$BN$31","v":"Länge l"},null,null,null,{"$f":"$BN$26","v":"Weg s"},null,null,null,{"$f":"$BN$27","v":"Kraft F"},null,null,null,{"$f":"BN67","v":"Einzelfeder"},null,"BJ",3050,"Becker",7,null,"a1",-6.1157311170410864,"x",null,3.6699263738180856,"x",null,-43.381236574409201,"x",null,null,null,null,null,null,null,"Weg s","Weg s","travel s","Course s"]
[null,{"$f":"$BN$24","v":"punkt"},null,null,"%",null,null,{"$f":"$AT$53","v":" mm"},null,null,null,{"$f":"$AT$53","v":" mm"},null,null,{"$f":"$AT$54","v":" N"},null,null,null,{"$f":"$AT$55","v":"MPa"},null,null,null,null,null,null,null,null,null,null,null,{"$f":"$AT$53","v":" mm"},null,null,null,{"$f":"$AT$53","v":" mm"},null,null,null,{"$f":"$AT$54","v":" N"},null,null,null,{"$f":"BN68","v":"Kraft"},null,"WÜS",3205,"Wüst",8,null,"a2",0.14463573223442264,"x*x",null,-2.2546290579634394E-3,"x*x",null,0.1204467699703401,"x*x",null,null,null,"Lebensdauer Zeile 4",null,null,null,"Kraft F","Kraft F","load F","Force F"]
[null,0,null,null,{"$f":"L28/D21*100","v":0},null,null,{"$f":"$J$18","v":0.55000000000000004},null,null,null,null,null,null,null,null,null,null,null,null,null,null,null,null,null,null,null,null,null,null,{"$f":"(H28+($J$23-1)*$J$17)*$B$23","v":0.55000000000000004},null,null,null,null,null,null,null,null,null,null,null,{"$f":"BN67","v":"Einzelfeder"},null,"TJ",3561,"Terzyk",9,null,null,null,null,null,null,null,null,null,null,null,null,null,"Input",null,null,null,"Plan","Plan","Flat","à plat"]
[null,1,null,null,{"$f":"L29/D21","v":0.24799999999999994},null,null,0.48800000000000004,null,null,null,{"$f":"$J$18-H29","v":6.2E-2},null,null,{"$f":"$AX$5*$AT$5^3*L29*$AT$51*$AY$12*$AY$12/$AV$3/$AT$1^2*AS36/$AT$52","v":45.37221045222546},null,null,null,{"$f":"-$AX$5*$AT$5/$AV$3/$AT$1^2*L29*$AT$51*$AY$12*($AX$3*($AY$13/$AT$5-L29*$AT$51*$AY$12/2/$AT$5)+$AX$4)*$AT$56","v":-876.00355126088471},null,null,{"$f":"-$AX$5*$AT$5/$AV$3/$AT$1^2*L29*$AT$51*$AY$12*($AX$3*($AY$13/$AT$5-L29*$AT$51*$AY$12/2/$AT$5)-$AX$4)*$AT$56","v":205.45067070542956},null,null,{"$f":"-$AX$5*$AT$5/$AV$3/$AT$1^2*L29*$AT$51*$AY$12/$AV$2*(($AX$3-2*$AX$4)*($AY$13/$AT$5-L29*$AT$51*$AY$12/2/$AT$5)-$AX$4)*$AT$56","v":397.96490109633561},null,null,{"$f":"-3*$AX$5*$AT$5/$AV$3/$AT$1^2*L29*$AT$51*$AY$12/$AV$5*$AT$56","v":-330.30882684463631},null,null,{"$f":"(H29+($J$23-1)*$J$17)*$B$23","v":0.48800000000000004},null,null,null,{"$f":"L29*$B$23","v":6.2E-2},null,null,null,{"$f":"O29*$J$23","v":45.37221045222546},null,null,null,{"$f":"BN69","v":"Länge"},null,{"$f":"IF(AV29>1,CONCATENATE(INDEX(AT20:AT28,AV29),\" (\",INDEX(AS20:AS28,AV29),\")\"),CONCATENATE(INDEX(AT20:AT28,AV29)))","v":"3510"},null,{"$f":"INDEX(AU20:AU28,AV29)","v":"Weib"},{"$f":"_xlfn.IFNA(VLOOKUP(B5,AS21:AV28,4,FALSE),1)","v":1},null,null,null,"Näherung des Setzverlustes CK Stähle 20°",null,null,null,null,null,"Lebensdauer Zeile 1",null,null,null,"Weg","L1","L2",null,"rechnerische","rechnerische","calculated","Contraintes de fatigue"]
[null,2,null,null,{"$f":"L30/D21","v":0.74799999999999989},null,null,0.36300000000000004,null,null,null,{"$f":"$J$18-H30","v":0.187},null,null,{"$f":"$AX$5*$AT$5^3*L30*$AT$51*$AY$12*$AY$12/$AV$3/$AT$1^2*AS37/$AT$52","v":104.18089923367049},null,null,null,{"$f":"-$AX$5*$AT$5/$AV$3/$AT$1^2*L30*$AT$51*$AY$12*($AX$3*($AY$13/$AT$5-L30*$AT$51*$AY$12/2/$AT$5)+$AX$4)*$AT$56","v":-2353.5447075446364},null,null,{"$f":"-$AX$5*$AT$5/$AV$3/$AT$1^2*L30*$AT$51*$AY$12*($AX$3*($AY$13/$AT$5-L30*$AT$51*$AY$12/2/$AT$5)-$AX$4)*$AT$56","v":908.26076838602114},null,null,{"$f":"-$AX$5*$AT$5/$AV$3/$AT$1^2*L30*$AT$51*$AY$12/$AV$2*(($AX$3-2*$AX$4)*($AY$13/$AT$5-L30*$AT$51*$AY$12/2/$AT$5)-$AX$4)*$AT$56","v":1043.9343833319394},null,null,{"$f":"-3*$AX$5*$AT$5/$AV$3/$AT$1^2*L30*$AT$51*$AY$12/$AV$5*$AT$56","v":-996.25404225720968},null,null,{"$f":"(H30+($J$23-1)*$J$17)*$B$23","v":0.36300000000000004},null,null,null,{"$f":"L30*$B$23","v":0.187},null,null,null,{"$f":"O30*$J$23","v":104.18089923367049},null,null,null,{"$f":"BN70","v":"Säule"},null,null,null,null,null,null,"sigma 1","48 h","48h_näher","Fehler","1000h","1000h_näher","Fehler",null,{"$f":"IF($BI$47,CONCATENATE($BN$143,\" \",$BN$46),CONCATENATE($BN$40,\": \",$BF$14,\" \",$BN$47))","v":"Lebensdauer von Mubea Federn: größer als 2 Mio. Lastzyklen (Pü=99%)"},null,null,null,{"$f":"ABS(BK30-BL30)","v":0.125},{"$f":"INDEX($AE$28:$AH$33,$AQ$41+1,1)","v":0.48800000000000004},{"$f":"INDEX($AE$28:$AH$33,$AQ$42+1,1)","v":0.36300000000000004},null,"Randspannungen","Randspannungen","stresses","calculées"]
[null,{"$f":"IF(ISBLANK($H31),\" \",\"3\")","v":" "},null,null,{"$f":"IF(ISBLANK(H31),\" \",L31/D21)","v":" "},null,null,null,null,null,null,{"$f":"IF(ISBLANK($H31),\" \",IF((H31>($J$18+0.00001)),\"l > l0\",$J$18-H31))","v":" "},null,null,{"$f":"IF(ISBLANK($H31),\" \",$AX$5*$AT$5^3*L31*$AT$51*$AY$12*$AY$12/$AV$3/$AT$1^2*AS38/$AT$52)","v":" "},null,null,null,{"$f":"IF(ISBLANK($H31),\" \",-$AX$5*$AT$5/$AV$3/$AT$1^2*L31*$AT$51*$AY$12*($AX$3*($AY$13/$AT$5-L31*$AT$51*$AY$12/2/$AT$5)+$AX$4)*$AT$56)","v":" "},null,null,{"$f":"IF(ISBLANK($H31),\" \",-$AX$5*$AT$5/$AV$3/$AT$1^2*L31*$AT$51*$AY$12*($AX$3*($AY$13/$AT$5-L31*$AT$51*$AY$12/2/$AT$5)-$AX$4)*$AT$56)","v":" "},null,null,{"$f":"IF(ISBLANK($H31),\" \",-$AX$5*$AT$5/$AV$3/$AT$1^2*L31*$AT$51*$AY$12/$AV$2*(($AX$3-2*$AX$4)*($AY$13/$AT$5-L31*$AT$51*$AY$12/2/$AT$5)-$AX$4)*$AT$56)","v":" "},null,null,{"$f":"IF(ISBLANK($H31),\" \",-3*$AX$5*$AT$5/$AV$3/$AT$1^2*L31*$AT$51*$AY$12/$AV$5*$AT$56)","v":" "},null,null,{"$f":"IF(ISBLANK($H31),\" \",(H31+($J$23-1)*$J$17)*$B$23)","v":" "},null,null,null,{"$f":"IF(ISBLANK($H31),\" \",L31*$B$23)","v":" "},null,null,null,{"$f":"IF(ISBLANK($H31),\" \",O31*$J$23)","v":" "},null,null,null,{"$f":"BN66","v":"Weg"},null,null,null,null,null,null,0,0,{"$f":"$AY$38+$AY$39*AX31+$AY$40*AX31*AX31","v":1.3776460773157912E-2},{"$f":"(AY31-AZ31)^2","v":1.8979087143435868E-4},0,{"$f":"$BB$38+$BB$39*AX31+$BB$40*AX31*AX31","v":1.9347770566145644E-2},{"$f":"(BB31-BC31)^2","v":3.7433622588021174E-4},null,"Lebensdauer Zeile 2 und 3",null,null,null,"Output",null,null,null,"Länge l","Länge l","height l","Long. L"]
[null,{"$f":"IF(ISBLANK($H32),\" \",\"4\")","v":" "},null,null,{"$f":"IF(ISBLANK(H32),\" \",L32/D21)","v":" "},null,null,null,null,null,null,{"$f":"IF(ISBLANK($H32),\" \",IF((H32>($J$18+0.00001)),\"l > l_0\",$J$18-H32))","v":" "},null,null,{"$f":"IF(ISBLANK($H32),\" \",$AX$5*$AT$5^3*L32*$AT$51*$AY$12*$AY$12/$AV$3/$AT$1^2*AS39/$AT$52)","v":" "},null,null,null,{"$f":"IF(ISBLANK($H32),\" \",-$AX$5*$AT$5/$AV$3/$AT$1^2*L32*$AT$51*$AY$12*($AX$3*($AY$13/$AT$5-L32*$AT$51*$AY$12/2/$AT$5)+$AX$4)*$AT$56)","v":" "},null,null,{"$f":"IF(ISBLANK($H32),\" \",-$AX$5*$AT$5/$AV$3/$AT$1^2*L32*$AT$51*$AY$12*($AX$3*($AY$13/$AT$5-L32*$AT$51*$AY$12/2/$AT$5)-$AX$4)*$AT$56)","v":" "},null,null,{"$f":"IF(ISBLANK($H32),\" \",-$AX$5*$AT$5/$AV$3/$AT$1^2*L32*$AT$51*$AY$12/$AV$2*(($AX$3-2*$AX$4)*($AY$13/$AT$5-L32*$AT$51*$AY$12/2/$AT$5)-$AX$4)*$AT$56)","v":" "},null,null,{"$f":"IF(ISBLANK($H32),\" \",-3*$AX$5*$AT$5/$AV$3/$AT$1^2*L32*$AT$51*$AY$12/$AV$5*$AT$56)","v":" "},null,null,{"$f":"IF(ISBLANK($H32),\" \",(H32+($J$23-1)*$J$17)*$B$23)","v":" "},null,null,null,{"$f":"IF(ISBLANK($H32),\" \",L32*$B$23)","v":" "},null,null,null,{"$f":"IF(ISBLANK($H32),\" \",O32*$J$23)","v":" "},null,null,null,{"$f":"BN70","v":"Säule"},null,null,null,null,null,null,1000,0.25,0.19323997546006949,3.2217003857735135E-3,0.5,0.45626148591269516,1.9130576145653636E-3,null,{"$f":"CONCATENATE(BJ36,BJ37,BJ38,BJ39,BJ40,BJ41,BJ42,BJ43,BJ44,BJ48,BJ45,BJ46)","v":""},null,null,null,{"$f":"IF(BI47,\"\",CONCATENATE($BN$97,ROUND($BJ$30,2),$AT$53,$BN$48,\" \"&ROUND($BK$30,2),$AT$53,$BN$49,\" \"&ROUND($BL$30,2),$AT$53))","v":"Weg: 0,13 mm zwischen L 1 : 0,49 mm und L 2 : 0,36 mm"},null,null,null,"der Säule","der Säule","of stack","de l'empilage"]
[null,{"$f":"IF(ISBLANK($H33),\" \",\"5\")","v":" "},null,null,{"$f":"IF(ISBLANK(H33),\" \",L33/D21)","v":" "},null,null,null,null,null,null,{"$f":"IF(ISBLANK($H33),\" \",IF((H33>($J$18+0.00001)),\"l > l_0\",$J$18-H33))","v":" "},null,null,{"$f":"IF(ISBLANK($H33),\" \",$AX$5*$AT$5^3*L33*$AT$51*$AY$12*$AY$12/$AV$3/$AT$1^2*AS40/$AT$52)","v":" "},null,null,null,{"$f":"IF(ISBLANK($H33),\" \",-$AX$5*$AT$5/$AV$3/$AT$1^2*L33*$AT$51*$AY$12*($AX$3*($AY$13/$AT$5-L33*$AT$51*$AY$12/2/$AT$5)+$AX$4)*$AT$56)","v":" "},null,null,{"$f":"IF(ISBLANK($H33),\" \",-$AX$5*$AT$5/$AV$3/$AT$1^2*L33*$AT$51*$AY$12*($AX$3*($AY$13/$AT$5-L33*$AT$51*$AY$12/2/$AT$5)-$AX$4)*$AT$56)","v":" "},null,null,{"$f":"IF(ISBLANK($H33),\" \",-$AX$5*$AT$5/$AV$3/$AT$1^2*L33*$AT$51*$AY$12/$AV$2*(($AX$3-2*$AX$4)*($AY$13/$AT$5-L33*$AT$51*$AY$12/2/$AT$5)-$AX$4)*$AT$56)","v":" "},null,null,{"$f":"IF(ISBLANK($H33),\" \",-3*$AX$5*$AT$5/$AV$3/$AT$1^2*L33*$AT$51*$AY$12/$AV$5*$AT$56)","v":" "},null,null,{"$f":"IF(ISBLANK($H33),\" \",(H33+($J$23-1)*$J$17)*$B$23)","v":" "},null,null,null,{"$f":"IF(ISBLANK($H33),\" \",L33*$B$23)","v":" "},null,null,null,{"$f":"IF(ISBLANK($H33),\" \",O33*$J$23)","v":" "},null,null,null,{"$f":"BN68","v":"Kraft"},null,"k","s_diagr",null,null,null,1500,0.3,0.33832407346878257,1.4687346072406451E-3,0.75,0.75060623115344249,3.6751621140421616E-7,null,null,null,null,null,null,null,null,null,"der Einzelfeder","der Einzelfeder","of one spring","d'une rondelle ressort"]
[null,{"$f":"BN28","v":"Plan"},null,null,null,null,null,{"$f":"$J$17","v":0.3},null,null,null,{"$f":"IF((H34>($J$18+0.00001)),\"l_1 > l_0\",$J$18-H34)","v":0.25000000000000006},null,null,{"$f":"$AX$5*$AT$5^3*L34*$AT$51*$AY$12*$AY$12/$AV$3/$AT$1^2*AS41/$AT$52","v":125.52771578600478},null,null,null,{"$f":"-$AX$5*$AT$5/$AV$3/$AT$1^2*L34*$AT$51*$AY$12*($AX$3*($AY$13/$AT$5-L34*$AT$51*$AY$12/2/$AT$5)+$AX$4)*$AT$56","v":-2951.9957346447823},null,null,{"$f":"-$AX$5*$AT$5/$AV$3/$AT$1^2*L34*$AT$51*$AY$12*($AX$3*($AY$13/$AT$5-L34*$AT$51*$AY$12/2/$AT$5)-$AX$4)*$AT$56","v":1408.7067732839055},null,null,{"$f":"-$AX$5*$AT$5/$AV$3/$AT$1^2*L34*$AT$51*$AY$12/$AV$2*(($AX$3-2*$AX$4)*($AY$13/$AT$5-L34*$AT$51*$AY$12/2/$AT$5)-$AX$4)*$AT$56","v":1290.2664606350104},null,null,{"$f":"-3*$AX$5*$AT$5/$AV$3/$AT$1^2*L34*$AT$51*$AY$12/$AV$5*$AT$56","v":-1331.8904308251467},null,null,{"$f":"(H34+($J$23-1)*$J$17)*$B$23","v":0.3},null,null,null,{"$f":"L34*$B$23","v":0.25000000000000006},null,null,null,{"$f":"O34*$J$23","v":125.52771578600478},null,null,null,{"$f":"BN70","v":"Säule"},null,null,null,null,null,null,2000,0.5,0.5203097319210005,4.1248521070290649E-4,1.125,1.0955429014391715,8.6772065562236173E-4,null,"Bemerkungen",null,null,null,null,null,null,null,{"$f":"IF($AQ$2=1,BO34,IF($AQ$2=2,BP34,IF($AQ$2=3,BQ34,\"Wrong language selection\")))","v":"Spezifikation"},"Spezifikation","specification","Spécification"]
[null,{"$f":"BN34","v":"Spezifikation"},null,null,null,null,null,null,null,null,null,null,null,null,null,null,null,null,null,null,null,null,null,null,null,null,null,null,null,null,null,null,null,null,null,null,null,null,null,null,null,null,{"$f":"BN141","v":"Werkstoffwahl"},null,{"$f":"($AV$6/$AT$5-M28*$AT$51/$AT$5)*($AV$6/$AT$5-M28*$AT$51/2/$AT$5)+$AV$4","v":1.6944444444444449},null,null,null,null,2500,0.75,0.73919695081672321,1.1670587165629735E-4,1.375,1.4910714967698822,1.3472592362400764E-2,null,"Parameter","Ist","n.i.O.-Kriterium",null,"Ausgabe",null,null,null,"Werkstoff:","Werkstoff:","material:","Matière:"]
[null,{"$f":"BN35","v":"Werkstoff:"},null,null,null,null,null,null,null,null,null,null,null,{"$f":"AU99","v":"1.8159 (51 CrV 4)"},null,null,null,null,null,null,null,null,null,{"$f":"$BN$50","v":"E-Modul:"},null,null,null,null,null,null,{"$f":"ROUND($AS$99*$AT$60,1)","v":206000},null,null,null,null,null,null,{"$f":"$AT$59","v":"MPa"},null,null,null,null,null,null,{"$f":"($AY$13/$AT$5-L29*$AT$51*$AY$12/$AT$5)*($AY$13/$AT$5-L29*$AT$51*$AY$12/2/$AT$5)+$AV$4","v":1.4574666666666669},{"$f":"AI29*1","v":6.2E-2},null,null,null,3000,1,0.99498573015595082,2.5142902068940982E-5,2,1.9371920171455743,3.9448427102418302E-3,null,"Material",{"$f":"$AT$99","v":2},"> 3",{"$f":"$BG$36>3","v":false},{"$f":"IF($BI$36,$BN$194&\"; \",\"\")","v":""},null,null,null,"Oberfläche:","Oberfläche:","surface finish:","Finition de surface:"]
[null,{"$f":"BN36","v":"Oberfläche:"},null,null,null,null,null,null,null,null,null,null,null,{"$f":"IF($AT$99<4,$BN$37,\"\")","v":"kugelgestrahlt"},null,null,null,null,null,null,null,null,null,{"$f":"$BN$137","v":"Temperatur:"},null,null,null,null,null,null,20,null,null,null,null,null,null,{"$f":"$AT$62","v":"°C"},null,null,null,null,null,null,1.1095500000000003,0.187,null,null,null,null,null,null,{"$f":"SUM(BA31:BA36)","v":5.4345598488766619E-3},null,null,{"$f":"SUM(BD31:BD36)","v":2.0572917084921937E-2},null,"Anzahl Federn",{"$f":"$J$23*$B$23","v":1},"> 60",{"$f":"$BG$37>60","v":false},{"$f":"IF($BI$37,$BN$41&\"; \",\"\")","v":""},null,null,null,"kugelgestrahlt","kugelgestrahlt","shot peening","grenaillage de précontrainte"]
[null,{"$f":"BN38","v":"Korrosionsschutz:"},null,null,null,null,null,null,null,null,null,null,null,{"$f":"IF($AT$99<4,$BN$39,$BN$173)","v":"phosphatiert und geölt"},null,null,null,null,null,null,null,null,null,null,null,null,null,null,null,null,null,null,null,null,null,null,null,null,null,null,null,null,{"$f":"BN64","v":"Lebensdauer-"},null,{"$f":"($AY$13/$AT$5-L31*$AT$51*$AY$12/$AT$5)*($AY$13/$AT$5-L31*$AT$51*$AY$12/2/$AT$5)+$AV$4","v":{"$error":"#VALUE!"}},{"$error":"#VALUE!"},null,null,null,"a0",1.3776460773157912E-2,null,null,1.9347770566145644E-2,null,null,null,"Schichtung",{"$f":"$J$23","v":1},"> 2",{"$f":"$BG$38>2","v":false},{"$f":"IF($BI$38,$BN$42&\"; \",\"\")","v":""},null,null,null,"Korrosionsschutz:","Korrosionsschutz:","corrosion prot.:","Protection à la corrosion:"]
[null,{"$f":"$BF$30","v":"Lebensdauer von Mubea Federn: größer als 2 Mio. Lastzyklen (Pü=99%)"},null,null,null,null,null,null,null,null,null,null,null,null,null,null,null,null,null,null,null,null,null,null,null,null,null,null,null,null,null,null,null,null,null,null,null,null,null,null,null,null,{"$f":"BN65","v":"berechnungen"},null,{"$error":"#VALUE!"},{"$error":"#VALUE!"},null,null,null,"a1",1.0566039379990184E-4,"x",null,3.357298652565861E-4,"x",null,null,"Pakete",{"$f":"$B$23","v":1},"Pakete > 15 UND Schichtung > 1 ",{"$f":"AND($BG$39>15,$BG$38>1)","v":false},{"$f":"IF($BI$39,$BN$44&\"; \",\"\")","v":""},null,null,null,"phosphatiert und geölt","phosphatiert und geölt","phosphated and oiled","phosphaté et huilé"]
[null,{"$f":"$BF$32","v":""},null,null,null,null,null,null,null,null,null,null,null,null,null,null,null,null,null,null,null,null,null,null,null,null,null,null,null,null,null,null,null,null,null,null,null,null,null,null,null,null,{"$f":"BN43","v":"zw. d. Lastp."},null,{"$error":"#VALUE!"},{"$error":"#VALUE!"},null,null,null,"a2",7.3803120887009714E-8,"x*x",null,1.011838500899634E-7,"x*x",null,null,"Sigma II 2",{"$f":"$BB$9","v":908.26076838602114},{"$f":"CONCATENATE(\"> \",$BB$2,\"(Max Oberspannnung)\")","v":"> 1300(Max Oberspannnung)"},{"$f":"$BG$40>$BB$2","v":false},{"$f":"IF($BI$40,$BN$45&\" (Sigma II); \",\"\")","v":""},null,null,null,"Lebensdauer von Mubea Federn","Lebensdauer von Mubea Federn","fatigue life of Mubea springs","Durée de vie de Mubea rond. res."]
[null,null,null,null,null,null,null,null,null,null,null,null,null,null,null,null,null,null,null,null,null,null,null,null,null,null,null,null,null,null,null,null,null,null,null,null,null,null,null,null,null,null,1,null,1,0.25000000000000006,null,null,null,null,null,null,null,null,null,null,null,"Sigma III 2",{"$f":"$BB$11","v":1043.9343833319394},{"$f":"CONCATENATE(\"> \",$BB$2,\"(Max Oberspannnung)\")","v":"> 1300(Max Oberspannnung)"},{"$f":"$BG$41>$BB$2","v":false},{"$f":"IF($BI$41,$BN$45&\" (Sigma III); \",\"\")","v":""},null,null,null,"mehr als 60 Federn","mehr als 60 Federn","more than 60 springs","plus de 60 rondelles"]
[null,{"$f":"$BJ$32","v":"Weg: 0,13 mm zwischen L 1 : 0,49 mm und L 2 : 0,36 mm"},null,null,null,null,null,null,null,null,null,null,null,null,null,null,null,null,null,null,null,null,null,null,null,null,null,null,null,null,null,null,null,null,null,null,null,null,null,null,null,null,2,null,null,null,null,null,null,null,null,"Näherung des Setzverlustes CK Stähle 100°",null,null,null,null,null,"t'",{"$f":"$AT$5","v":0.3},"> 16",{"$f":"$BG$42>16","v":false},{"$f":"IF($BI$42,$BN$109&\"; \",\"\")","v":""},null,null,null,"mehr als 2 fach geschichtet","mehr als 2 fach geschichtet","more than 2 springs stacked","> de 2 rond. /paquet"]
[null,{"$f":"$BN$54","v":"Bemerkungen"},null,null,null,null,null,null,null,null,null,null,null,null,null,null,null,null,null,null,null,null,null,null,null,null,null,null,null,null,null,null,null,null,null,null,null,null,null,null,null,null,{"$f":"BN81","v":"Lebensdauer"},null,null,null,null,null,null,"sigma 1","48 h","48h_näher","Fehler","1000h","1000h_näher","Fehler",null,"s1/h0",{"$f":"MIN(E29:G33)","v":0.24799999999999994},"< 0,15",{"$f":"$BG$43<0.15","v":false},{"$f":"IF($BI$43,$BN$52&\"; \",\"\")","v":""},null,null,null,"zw. d. Lastp.","zw. d. Lastp.","betw. loadp.","entre pt charge n°"]
[null,null,null,null,null,null,null,null,null,null,null,null,null,null,null,null,null,null,null,null,null,null,null,null,null,null,null,null,null,null,null,null,null,null,null,null,null,null,null,null,null,null,{"$f":"BN83","v":"löschen"},null,null,null,null,null,null,0,0,{"$f":"$AY$51+$AY$52*AX44+$AY$53*AX44*AX44","v":3.5654658404179237E-2},{"$f":"(AY44-AZ44)^2","v":1.2712546659187092E-3},0,{"$f":"$BB$51+$BB$52*AX44+$BB$53*AX44*AX44","v":2.1619265370150281E-2},{"$f":"(BB44-BC44)^2","v":4.6739263514497916E-4},null,"s2/h0",{"$f":"MAX(E29:G33)","v":0.74799999999999989},"> 0,8",{"$f":"$BG$44>0.8","v":false},{"$f":"IF($BI$44,$BN$53&\"; \",\"\")","v":""},null,null,null,"mehr als 15 Pakete","mehr als 15 Pakete","more than 15 packets","plus de 15 paquets"]
[null,null,null,null,null,null,null,null,null,null,null,null,null,null,null,null,null,null,null,null,null,null,null,null,null,null,null,null,null,null,null,null,null,null,null,null,null,null,null,null,null,null,{"$f":"BN82","v":"Lebensdauer"},null,"Toleranzhilfe",null,null,null,null,1000,1.625,1.5953017706426933,8.8198482695919377E-4,2.375,2.1311718410000862,5.9452171121287263E-2,null,"h(L1)",{"$f":"INDEX($H$28:$K$33,$AQ41+1,1)","v":0.48800000000000004},"h(L1) = 0",{"$f":"BG45=0","v":false},{"$f":"IF(BI45,$BN$196,\"\")","v":""},null,null,null,"Dynamische Oberspannung zu groß","Dynamische Oberspannung zu groß","dynamic upper stress too high","Contrainte dynamique sup. trop grande"]
[null,null,null,null,null,null,null,null,null,null,null,null,null,null,null,null,null,null,null,null,null,null,null,null,null,null,null,null,null,null,null,null,null,null,null,null,null,null,null,null,null,null,{"$f":"BN84","v":"hinzufügen"},null,{"$f":"IF($AT$2<6,$AT$2+0.12,IF($AT$2<10,$AT$2+0.15,IF($AT$2<18,$AT$2+0.18,IF($AT$2<30,$AT$2+0.21,IF($AT$2<50,$AT$2+0.25,IF($AT$2<80,$AT$2+0.3,IF($AT$2<120,$AT$2+0.35,$AT$46)))))))","v":3.3200000000000003},{"$f":"IF($AT$2<180,$AT$2+0.4,IF($AT$2<250,$AT$2+0.46,IF($AT$2<315,$AT$2+0.52,IF($AT$2<400,$AT$2+0.57,IF($AT$2<500,$AT$2+0.63,IF($AT$2<600,$AT$2+0.68,$AT$2+0.75))))))","v":3.6},null,null,null,1500,2.5,2.5461464632306541,2.1294960686981087E-3,3.5,3.5135005677114055,1.8226532853024498E-4,null,"h(L2)",{"$f":"INDEX($H$28:$K$33,$AQ42+1,1)","v":0.36300000000000004},"h(L2) = 0",{"$f":"BG46=0","v":false},{"$f":"IF(AND($BJ45=\"\",$BI46),$BN$196,\"\")","v":""},null,null,null,"Rücksprache mit Mubea","Rücksprache mit Mubea","please contact Mubea","Veuillez contacter Mubea"]
[null,{"$f":"$BF$51","v":""},null,null,null,null,null,null,null,null,null,null,null,null,null,null,null,null,null,null,null,null,null,null,null,null,null,null,null,null,null,null,null,null,null,null,null,null,null,null,null,null,null,null,{"$f":"IF($AT$1<6,$AT$1-0.12,IF($AT$1<10,$AT$1-0.15,IF($AT$1<18,$AT$1-0.18,IF($AT$1<30,$AT$1-0.21,IF($AT$1<50,$AT$1-0.25,IF($AT$1<80,$AT$1-0.3,IF($AT$1<120,$AT$1-0.35,$AT$47)))))))","v":7.85},{"$f":"IF($AT$1<180,$AT$1-0.4,IF($AT$1<250,$AT$1-0.46,IF($AT$1<315,$AT$1-0.52,IF($AT$1<400,$AT$1-0.57,IF($AT$1<500,$AT$1-0.63,IF($AT$1<600,$AT$1-0.68,$AT$1-0.75))))))","v":7.6},null,null,null,2000,3.625,3.6110052467977507,1.9585311719186701E-4,5,5.1141975870202918,1.304108888125712E-2,null,"Ergebnis:",null,null,{"$f":"OR($BI$36:$BI$46)","v":false},null,null,null,null,"Lastzyklen (Pü=99%)","Lastzyklen (Pü=99%)","load cycles (Pü=99%)","cycles (Pü=99%)"]
[null,{"$f":"$BF$53","v":""},null,null,null,null,null,null,null,null,null,null,null,null,null,null,null,null,null,null,null,null,null,null,null,null,null,null,null,null,null,null,null,null,null,null,null,null,null,null,null,null,null,null,null,null,null,null,null,2500,4.75,4.7898781213439818,1.5902645619253392E-3,6.9,6.9332628989267455,1.1064204450108646E-3,null,"t'",{"$f":"$AT$5","v":0.3},"5 <= t <= 7",{"$f":"AND($BG$48>=5,$BG$48<=7)","v":false},{"$f":"IF(AND($BI$48,NOT($BI$47)),$BN$177,\"\")","v":""},null,null,null," zwischen L 1 :",{"$f":"\" zwischen L \"&$AQ$41&\" :\"","v":" zwischen L 1 :"},{"$f":"\" between L \"&$AQ$41&\" :\"","v":" between L 1 :"},{"$f":"\" entre L \"&$AQ$41&\" :\"","v":" entre L 1 :"}]
[null,null,null,null,null,null,null,null,null,null,null,null,null,null,null,null,null,null,null,null,null,null,null,null,null,null,null,null,null,null,null,null,null,null,null,null,null,null,null,null,null,null,null,null,null,null,null,null,null,3000,6.1,6.0827650868693501,2.9704223062103488E-4,9.125,8.9706965034307675,2.3809569053491138E-2,null,null,null,null,null,null,null,null,null," und L 2 :",{"$f":"\" und L \"&$AQ$42&\" :\"","v":" und L 2 :"},{"$f":"\" and L \"&$AQ$42&\" :\"","v":" and L 2 :"},{"$f":"\" et L\"&$AQ$42&\" :\"","v":" et L2 :"}]
[null,{"$f":"$BN$104","v":"DIN-Toleranz der Federkraft:"},null,null,null,null,null,null,null,null,null,null,{"$f":"IF($AT$5<1.25,\"+25 / -7,5%\",IF($AT$5<=3,\"+15 / -7,5%\",IF($AT$5<=6,\"+10 / -5%\",\"+5 / -5%\")))","v":"+25 / -7,5%"},null,null,null,null,{"$f":"$BN$105","v":"bei 75% von h0 einer Feder"},null,null,null,null,null,null,null,null,null,null,null,null,null,null,null,null,null,null,null,null,null,null,null,null,null,null,"Einheitensteuerung",null,null,null,null,null,null,null,{"$f":"SUM(BA44:BA49)","v":6.3658954713142531E-3},null,null,{"$f":"SUM(BD44:BD49)","v":9.8058907464721595E-2},null,"Kommentar Zeile 1",null,null,null,"Hilfe für Lastpunkte","Wert","Index",null,"E-Modul:","E-Modul:","Youngs-modulus:","module E:"]
[null,null,null,null,null,null,null,null,null,null,null,null,null,null,null,null,null,null,null,null,null,null,null,null,null,null,null,null,null,null,null,null,null,null,null,null,null,null,null,null,null,null,null,null,"mm/inch",{"$f":"IF($AQ$7=2,$AV51,$AU51)","v":1},1,25.4,null,"a0",3.5654658404179237E-2,null,null,2.1619265370150281E-2,null,null,null,{"$f":"IF(OR(BI57:BI65),$BN$46,\"\")","v":""},null,null,null,"Min",{"$f":"MIN(E29:G33)","v":0.24799999999999994},{"$f":"MATCH(BK51,$E$29:$E$33)","v":1},null,"bei","bei","at","à"]
[null,null,null,null,null,null,null,null,{"$f":"$BN$2","v":"Berechnung von Tellerfedern"},null,null,null,null,null,null,null,null,null,null,null,null,null,null,null,null,null,null,null,null,{"$f":"IF($AT$4<1.25,$BN$3,IF($AT$4=$AT$5,$BN$108,$BN$94))","v":"Gruppe 1"},null,null,null,null,null,null,null,null,null,null,null,null,null,null,"N/lbf",1,1,4.4482200000000001,null,"a1",1.3316189302802425E-3,"x",null,1.672815990434801E-3,"x",null,null,"Kommentar Zeile 2 und 3",null,null,null,"Max",{"$f":"MAX(E29:G33)","v":0.74799999999999989},{"$f":"MATCH(BK52,$E$29:$E$33)","v":2},null,"Vorspannweg zu klein (S1)",{"$f":"\"Vorspannweg zu klein (S\" & $BL$51 & \")\"","v":"Vorspannweg zu klein (S1)"},{"$f":"\"preload travel too low (S\" & $BL$51 & \")\"","v":"preload travel too low (S1)"},{"$f":"\"S\" & $BL$51 & \" trop petit\"","v":"S1 trop petit"}]
[null,null,null,null,null,null,null,null,{"$f":"$BN$4","v":"Teile/Zeichn. Nr.:"},null,null,null,null,null,{"$f":"IF(ISBLANK($O$2),\"\",$O$2)","v":"17 0001"},null,null,null,null,null,null,null,null,null,null,{"$f":"$BN$174","v":"Revision"},null,null,null,{"$f":"IF(ISBLANK($AD$2),\"\",$AD$2)","v":""},null,null,null,null,null,null,null,null,null,null,null,null,null,null,null," mm"," mm"," inch",null,"a2",2.2802818195827151E-7,"x*x",null,4.3673658519513488E-7,"x*x",null,null,{"$f":"CONCATENATE(BJ57,BJ58,BJ59,BJ60,BJ61,BJ62,BJ63,BJ64,BJ65)","v":""},null,null,null,null,null,null,null,"Einfederung zu hoch (S2)",{"$f":"\"Einfederung zu hoch (S\"&BL52&\")\"","v":"Einfederung zu hoch (S2)"},{"$f":"\"Deflection too high (S\"&BL52&\")\"","v":"Deflection too high (S2)"},{"$f":"\"(S\"&BL52&\") trop grand\"","v":"(S2) trop grand"}]
[null,{"$f":"IF(ISBLANK($B$3),\"\",$B$3)","v":"K-Version 10.03.22"},null,null,null,null,null,null,{"$f":"$BN$5","v":"Projekt:"},null,null,null,null,null,{"$f":"IF(ISBLANK($O$3),\"\",$O$3)","v":""},null,null,null,null,null,null,null,null,null,null,{"$f":"$BN$175","v":"Kunde"},null,null,null,{"$f":"IF(ISBLANK($AD$3),\"\",$AD$3)","v":""},null,null,null,null,null,null,null,null,null,null,null,null,null,null,null," N"," N"," lbf",null,null,null,null,null,null,null,null,null,null,null,null,null,null,null,null,null,"Bemerkungen","Bemerkungen","remarks","Remarques"]
[null,{"$f":"IF(ISBLANK($B$4),\"\",B4)","v":"2022-03-10T14:18:38.430"},null,null,null,null,null,null,"Mubea Tellerfedern GmbH, Postfach 120, 57564 Daaden",null,null,null,null,null,null,null,null,null,null,null,null,null,null,null,null,null,null,null,null,null,null,null,null,null,null,null,null,null,null,null,null,null,null,null,null,"MPa","MPa","* 1000 psi",null,null,null,"Näherung des Setzverlustes Cr Stähle 20°",null,null,null,null,null,"Warnungen",null,null,null,null,null,null,null,"Federweg in  mm",{"$f":"\"Federweg in \"&$AT$53","v":"Federweg in  mm"},{"$f":"\"travel in \"&$AT$53","v":"travel in  mm"},{"$f":"\"Course en \"&$AT$53","v":"Course en  mm"}]
[null,{"$f":"IF(ISBLANK($B$5),\"\",$B$5)","v":""},null,null,null,null,null,null,{"$f":"$BN$107","v":"Tel.: Vertrieb: +49 2743/806- 3588, -3593, -3625; Entwicklung: +49 2743/806-3510"},null,null,null,null,null,null,null,null,null,null,null,null,null,null,null,null,null,null,null,null,null,null,null,null,null,null,null,null,null,null,null,null,null,null,null,"MPA/1000psi",1,1,{"$f":"145.03/1000","v":0.14502999999999999},null,"sigma 1","48 h","48h_näher","Fehler","1000h","1000h_näher","Fehler",null,"Parameter","Ist","n.i.O.-Kriterium",null,"Ausgabe",null,null,null,"Feder-","Feder-","spring-","Force"]
[null,null,null,null,null,null,null,null,null,null,null,null,null,null,null,null,null,null,null,null,null,null,null,null,null,null,null,null,null,null,null,null,null,null,null,null,null,null,null,null,null,null,null,null,null,"N/mm","N/mm","lbf/in",null,0,0,{"$f":"$AY$64+$AY$65*AX57+$AY$66*AX57*AX57","v":1.2315766573235784E-2},{"$f":"(AY57-AZ57)^2","v":1.5167810628643189E-4},0,{"$f":"$BB$64+$BB$65*AX57+$BB$66*AX57*AX57","v":1.8606142709478787E-2},{"$f":"(BB57-BC57)^2","v":3.4618854652549065E-4},null,"ho/t",{"$f":"(AV6)/$AT$5","v":0.83333333333333359},"> 1.3",{"$f":"$BG$57>1.3","v":false},{"$f":"IF($BI$57,$BN$176&\"; \",\"\")","v":""},"Federkennwerte",null,null,"kraft","kraft","load","du ressort"]
[null,null,null,null,null,null,null,null,null,null,null,null,null,null,null,null,null,null,null,null,null,null,null,null,null,null,null,null,null,null,null,null,null,null,null,null,null,null,null,null,null,null,null,null,"N/mm/lbf/in",1,1,{"$f":"$AV$51/$AV$52","v":5.7101492282306179},null,1000,7.0000000000000007E-2,6.4389890964921578E-2,3.1473323385468613E-5,0.25,0.21412086431808686,1.2873123772811329E-3,null,"De/Di",{"$f":"$AT$1/$AT$2","v":2.5},"<1,8 oder >2,5",{"$f":"OR($BG$58<1.8,$BG$58>2.5)","v":false},{"$f":"IF($BI$58,$BN$178&\" (De/Di)\"&\"; \",\"\")","v":""},"Federkennwerte",null,null,"Sprache","Sprache","Language","Langue"]
[null,null,null,null,null,null,null,null,null,null,null,null,null,null,null,null,null,{"$f":"$W$6","v":"Kennlinie der Tellerfeder"},null,null,null,null,null,null,null,null,null,null,null,null,null,null,null,null,null,null,null,null,null,null,null,null,null,null,null,"MPa","MPa","* 1E6 psi",null,1500,0.1,0.10369511738329484,1.3653892476327692E-5,0.36,0.35987436943058182,1.5783039972332869E-8,null,"De/t",{"$f":"$AT$1/$AT$5","v":26.666666666666668},"<16 oder > 40",{"$f":"OR($BG$59<16,$BG$59>40)","v":false},{"$f":"IF($BI$59,$BN$178&\" (De/t)\"&\"; \",\"\")","v":""},"Federkennwerte",null,null,"Diagramm-","Diagramm-","setup of","Modification"]
[null,null,null,null,null,null,null,null,null,null,null,null,null,null,null,null,null,null,null,null,null,null,null,null,null,null,null,null,null,null,null,null,null,null,null,null,null,null,null,null,null,null,null,null,"MPA/1000000psi",1,1,{"$f":"145.03/1000000","v":1.4503000000000001E-4},null,2000,0.15,0.15184578661668835,3.4069282343458449E-6,0.5,0.5376253040818707,1.4156635072532361E-3,null,"De/h0",{"$f":"$AT$1/$AV$6","v":31.999999999999993},null,null,null,"Federkennwerte",null,null,"steuerung","steuerung","curve","du diagramme"]
[null,null,null,null,null,null,null,null,null,null,null,null,null,null,null,null,null,null,null,null,null,null,null,null,null,null,null,null,null,null,null,null,null,null,null,null,null,null,null,null,null,null,null,null,null,20,{"$f":"$AE$37","v":20},{"$f":"($AE$37-32)*5/9","v":-6.666666666666667},null,2500,0.21,0.20884189866510214,1.3411987018921917E-6,0.75,0.74737366827195362,6.8976183457430984E-6,null,"Setzfestigkeit",{"$f":"$S$34","v":-2951.9957346447823},{"$f":"\"< \"&ROUND((MAX($AT$15+$AT$16*$R$20+$AT$17*$R$20*$R$20,-3600)*$AT$56),0)","v":"< -3600"},{"$f":"BG61<(MAX($AT$15+$AT$16*$R$20+$AT$17*$R$20*$R$20,-3600)*$AT$56)","v":false},{"$f":"IF($BI$61,$BN$179&\"; \",\"\")","v":""},"Statische Belastung",null,null,"Federweg","Federweg","travel","Course"]
[null,null,null,null,null,null,null,null,null,null,null,null,null,null,null,null,null,null,null,null,null,null,null,null,null,null,null,null,null,null,null,null,null,null,null,null,null,null,null,null,null,null,null,null,null,"°C","°C","°F",null,3000,0.27500000000000002,0.27468345352853618,1.0020166859620835E-7,1,0.98911946200083034,1.1838610715137489E-4,null,"Sigma Max",{"$f":"MAX(V29:AA33)","v":1043.9343833319394},"> 1680",{"$f":"BG62>1680","v":false},{"$f":"IF($BI$62,$BN$180&\"; \",\"\")","v":""},"Statische Belastung",null,null,"von","von","from","de:"]
[null,null,null,null,null,null,null,null,null,null,null,null,null,null,null,null,null,null,null,null,null,null,null,null,null,null,null,null,null,null,null,null,null,null,null,null,null,null,null,null,null,null,null,null,null,null,null,null,null,null,null,null,{"$f":"SUM(BA57:BA62)","v":2.0165365075306245E-4},null,null,{"$f":"SUM(BD57:BD62)","v":3.1744639395969499E-3},null,"min-temp",{"$f":"$BH$99","v":0},"> 0",{"$f":"BG63>0","v":false},{"$f":"IF($BI$63,$BN$144&\"; \",\"\")","v":""},"Temperatur",null,null,"bis","bis","to","à"]
[null,null,null,null,null,null,null,null,null,null,null,null,null,null,null,null,null,null,null,null,null,null,null,null,null,null,null,null,null,null,null,null,null,null,null,null,null,null,null,null,null,null,null,null,null,null,null,null,null,"a0",1.2315766573235784E-2,null,null,1.8606142709478787E-2,null,null,null,"max-temp",{"$f":"$BI$99","v":0},"> 0",{"$f":"BG64>0","v":false},{"$f":"IF($BI$64,$BN$145&\"; \",\"\")","v":""},"Temperatur",null,null,"Lebensdauer-","Lebensdauer-","calculation of ","Calcul de la"]
[null,null,null,null,null,null,null,null,null,null,null,null,null,null,null,null,null,null,null,null,null,null,null,null,null,null,null,null,null,null,null,null,null,null,null,null,null,null,null,null,null,null,{"$f":"$BN$59","v":"Diagramm-"},null,null,null,null,null,null,"a1",3.4383238761645301E-5,"x",null,1.3151986253102016E-4,"x",null,null,"Temperatur",{"$f":"$AT$61","v":20},"!= 20",{"$f":"BG65<>20","v":false},{"$f":"IF($BI$65,$BN$195,\"\")","v":""},"Temperatur",null,null,"berechnungen","berechnungen","fatigue life","durée de vie"]
[null,null,null,null,null,null,null,null,null,null,null,null,null,null,null,null,null,null,null,null,null,null,null,null,null,null,null,null,null,null,null,null,null,null,null,null,null,null,null,null,null,null,{"$f":"$BN$60","v":"steuerung"},null,null,null,null,null,null,"a2",1.7690885630040496E-8,"x*x",null,6.3994859077587903E-8,"x*x",null,null,null,null,null,null,null,null,null,null,{"$f":"IF($AQ$2=1,BO66,IF($AQ$2=2,BP66,IF($AQ$2=3,BQ66,\"Wrong language selection\")))","v":"Weg"},"Weg","travel of","Course"]
[null,null,null,null,null,null,null,null,null,null,null,null,null,null,null,null,null,null,null,null,null,null,null,null,null,null,null,null,null,null,null,null,null,null,null,null,null,null,null,null,null,null,{"$f":"$BN$101","v":"Anzeige der"},null,null,null,null,null,null,null,null,null,null,null,null,null,null,"Toleranzen",null,null,null,null,null,null,null,"Einzelfeder","Einzelfeder","one spring","1 rond. res."]
[null,null,null,null,null,null,null,null,null,null,null,null,null,null,null,null,null,null,null,null,null,null,null,null,null,null,null,null,null,null,null,null,null,null,null,null,null,null,null,null,null,null,{"$f":"$BN$102","v":"Spannungen"},null,null,null,null,null,null,null,null,"Näherung des Setzverlustes Cr Stähle 100°",null,null,null,null,null,"Parameter",null,"Kriterium","Toleranzfeld",null,null,null,null,"Kraft","Kraft","load of","Force"]
[null,null,null,null,null,null,null,null,null,null,null,null,null,null,null,null,null,null,null,null,null,null,null,null,null,null,null,null,null,null,null,null,null,null,null,null,null,null,null,null,null,null,{"$f":"$BN$103","v":"0 = nein, 1 = ja"},null,null,null,null,null,null,"sigma 1","48 h","48h_näher","Fehler","1000h","1000h_näher","Fehler",null,"t'",1,"t' < 1,25",{"$f":"BG69<1.25","v":true},{"$f":"IF($BI$69,\"+25 / -7,5%\",\"\")","v":"+25 / -7,5%"},null,null,null,"Länge","Länge","height of","Longueur"]
[null,null,null,null,null,null,null,null,null,null,null,null,null,null,null,null,null,null,null,null,null,null,null,null,null,null,null,null,null,null,null,null,null,null,null,null,null,null,null,null,null,null,1,null,null,null,null,null,null,0,0,{"$f":"$AY$77+$AY$78*AX70+$AY$79*AX70*AX70","v":2.9403415457091336E-2},{"$f":"(AY70-AZ70)^2","v":8.6456084054231772E-4},0,{"$f":"$BB$77+$BB$78*AX70+$BB$79*AX70*AX70","v":2.390751650386095E-2},{"$f":"(BB70-BC70)^2","v":5.7156934538238368E-4},null,"t'",{"$f":"BG69","v":1},"1,25 <= t' <= 3,0",{"$f":"AND(BG70>=1.25,BG70<=3)","v":false},{"$f":"IF($BI$70,\"+15 / -7,5%\",\"\")","v":""},null,null,null,"Säule","Säule","stack","empilage"]
[null,null,null,null,null,null,null,null,null,null,null,null,null,null,null,null,null,null,null,null,null,null,null,null,null,null,null,null,null,null,null,null,null,null,null,null,null,null,null,null,null,null,null,null,null,null,null,null,null,1000,1.25,1.2211007310239388,8.3516774735073397E-4,1.9,1.8293578837287598,4.9903085912794002E-3,null,"t'",{"$f":"BG70","v":1},"3,0 < t' <= 6,0",{"$f":"AND(BG71>3,BG71<=6)","v":false},{"$f":"IF($BI$71,\"+10 / -5%\",\"\")","v":""},null,null,null,"größer als 2 Mio.","größer als 2 Mio.","more than 2 Mio.","plus de 2 Mio."]
[null,null,null,{"$f":"BN56","v":"Feder-"},null,null,null,null,null,null,null,null,null,null,null,null,null,null,null,null,null,null,null,null,null,null,null,null,null,null,null,null,null,null,null,null,null,null,null,{"$f":"IF(AQ70=1,BN92,\" \")","v":"Spannung"},null,null,null,null,null,null,null,null,null,1500,2,1.9846616190005006,2.3526593168580288E-4,2.875,2.8714286399145994,1.2754612859592573E-5,null,"t'",{"$f":"BG71","v":1},"sonst",{"$f":"BG72>6","v":false},{"$f":"IF($BI$72,\"+5 / -5%\",\"\")","v":""},null,null,null,"Federhöhe:","Federhöhe:","spring height:","Hauteur:"]
[null,null,null,{"$f":"BN57","v":"kraft"},null,null,null,null,null,null,null,null,null,null,null,null,null,null,null,null,null,null,null,null,null,null,null,null,null,null,null,null,null,null,null,null,null,null,null,{"$f":"IF(AQ70=1,BN93,\" \")","v":"in"},null,null,null,null,null,null,null,null,null,2000,2.875,2.8600306604391541,2.24081126887906E-4,4,4.0063964444826992,4.0914502020252519E-5,null,"Ausgabe",null,null,null,null,null,null,null,"red. Blechdicke:","red. Blechdicke:","red. thickness:","Epaisseur réd.:"]
[null,null,null,{"$f":"BN96","v":"in N"},null,null,null,null,null,null,null,null,null,null,null,null,null,null,null,null,null,null,null,null,null,null,null,null,null,null,null,null,null,null,null,null,null,null,null,{"$f":"IF(AQ70=1,$AT$55,\" \")","v":"MPa"},null,null,null,null,null,null,null,null,null,2500,3.75,3.8472078553399003,9.4493671397829805E-3,5.125,5.2342612974330596,1.193803111675551E-2,null,{"$f":"CONCATENATE($BN$104,\" \",CONCATENATE($BJ$69,$BJ$70,$BJ$71,$BJ$72),\" \",$BN$105)","v":"DIN-Toleranz der Federkraft: +25 / -7,5% bei 75% von h0 einer Feder"},null,null,null,null,null,null,null,"Bitte die gewünschte Federkraft der Einzelfeder eingeben.","Bitte die gewünschte Federkraft der Einzelfeder eingeben.","Please enter required load of one spring","Entrez la force souhaitée pour la Rond. Ressort,  SVP."]
[null,null,null,null,null,null,null,null,null,null,null,null,null,null,null,null,null,null,null,null,null,null,null,null,null,null,null,null,null,null,null,null,null,null,null,null,null,null,null,null,null,null,null,null,null,null,null,null,null,3000,5,4.9461932037027383,2.8951713277750161E-3,6.625,6.5550231987656797,4.8967527109875656E-3,null,null,null,null,null,null,null,null,null,"Bitte die gewünschte Federkraft der Federsäule eingeben.","Bitte die gewünschte Federkraft der Federsäule eingeben.","Please enter required load of stack","Entrez la force souhaitée pour l'empilage,  SVP."]
[null,null,null,null,null,null,null,null,null,null,null,null,null,null,null,null,null,null,null,null,null,null,null,null,null,null,null,null,null,null,null,null,null,null,null,null,null,null,null,null,null,null,null,null,null,null,null,null,null,null,null,null,{"$f":"SUM(BA70:BA75)","v":1.4503614114024756E-2},null,null,{"$f":"SUM(BD70:BD75)","v":2.2450330879284702E-2},null,null,null,null,null,null,null,null,null,"Bitte den gewünschten Federweg der Federsäule eingeben.","Bitte den gewünschten Federweg der Federsäule eingeben.","Please enter required travel of stack","Entrez la course souhaitée pour l'empilage,  SVP."]
[null,null,null,null,null,null,null,null,null,null,null,null,null,null,null,null,null,null,null,null,null,null,null,null,null,null,null,null,null,null,null,null,null,null,null,null,null,null,null,null,null,null,null,null,null,null,null,null,null,"a0",2.9403415457091336E-2,null,null,2.390751650386095E-2,null,null,null,null,null,null,null,null,null,null,null,"Bitte die gewünschte Länge der Federsäule eingeben.","Bitte die gewünschte Länge der Federsäule eingeben.","Please enter required  height of stack","Entrez la longueur souhaitée pour l'empilage,  SVP."]
[null,null,null,null,null,null,null,null,null,null,null,null,null,null,null,null,null,null,null,null,null,null,null,null,null,null,null,null,null,null,null,null,null,null,null,null,null,null,null,null,null,null,null,null,null,null,null,null,null,"a1",9.6808100864266349E-4,"x",null,1.6196562704603786E-3,"x",null,null,null,null,null,null,null,null,null,null,"Bitte den gewünschten Weg der Einzelfeder eingeben.","Bitte den gewünschten Weg der Einzelfeder eingeben.","Please enter required travel of one spring","Entrez la course souhaitée pour l'empilage,  SVP."]
[null,null,null,null,null,null,null,null,null,null,null,null,null,null,null,null,null,null,null,null,null,null,null,null,null,null,null,null,null,null,null,null,null,null,null,null,null,null,null,null,null,null,null,null,null,null,null,null,null,"a2",2.2361630692418405E-7,"x*x",null,1.857940967645203E-7,"x*x",null,null,null,null,null,null,null,null,null,null,"Bitte eine Zeile im Kennlinienbereich l_1 bis l_5 wählen!","Bitte eine Zeile im Kennlinienbereich l_1 bis l_5 wählen!","Please select a row between l1 and l5","Selectionnez une cellule entre L1 et L5, SVP."]
[null,null,null,null,null,null,null,null,null,null,null,null,null,null,null,null,null,null,null,null,null,null,null,null,null,null,null,null,null,null,null,null,null,null,null,null,null,null,null,null,null,null,null,null,null,null,null,null,null,null,null,null,null,null,null,null,null,null,null,null,null,null,null,null,null,"Bitte eine Zeile im Bereich der Federtabelle wählen!","Bitte eine Zeile im Bereich der Federtabelle wählen!","Please select a row in data field","Selectionnez une cellule dans le tableau, SVP."]
[null,null,null,null,null,null,null,null,null,null,null,null,null,null,null,null,null,null,null,null,null,null,null,null,null,null,null,null,null,null,null,null,null,null,null,null,null,null,null,null,null,null,null,null,null,null,null,null,null,null,"Werkstoffe",null,null,null,null,null,null,null,null,null,null,null,null,null,null,"Lebensdauer","Lebensdauer","remove","Supprimer"]
[null,null,null,null,null,null,null,null,null,null,null,null,null,null,null,null,null,null,null,null,null,null,null,null,null,null,null,null,null,null,null,null,null,null,null,null,null,null,null,null,null,null,null,"Blechdicke","E-Berechnet","Auswahl","Name","Nummer","max. Materialdicke","min Temperatur","max Temperatur",null,null,null,"E-Modul",null,null,null,null,"min-temp","max temp","E-Näher",null,null,null,"Lebensdauer","Lebensdauer","add","Indiquer"]
[null,null,null,null,null,null,null,null,null,null,null,null,null,null,null,null,null,null,null,null,null,null,null,null,null,null,null,null,null,null,null,null,null,null,null,null,null,null,null,null,null,null,null,{"$f":"$AT$5","v":0.3},{"$f":"AT61","v":20},null,null,null,null,null,null,"20 °","100°","200°","300°","400°","500°","600°","700°",null,null,"n","m",null,null,"löschen","löschen","fatigue life","Durée de vie"]
[null,null,null,null,null,null,null,null,null,null,null,null,null,null,null,null,null,null,null,null,null,null,null,null,null,null,null,null,null,null,null,null,null,null,null,null,null,null,null,null,null,null,null,{"$f":"($AR$83>AW84)*AT84","v":0},{"$f":"IF(AT84=1,IF($AS$83=20,AZ84,BJ84),0)","v":0},{"$f":"IF($AT$99=1,1,0)","v":0},"1.1231 (C67S)","1.1231",1.25,-10,100,206000,202000,null,null,null,null,null,null,{"$f":"($AS$83<AX84)*AT84","v":0},{"$f":"($AS$83>AY84)*AT84","v":0},{"$f":"IF($AS$83<=20,AZ84,IF(AND($AS$83>20,$AS$83<100),AZ84+($AS$83-20)*BK84,BA84))","v":206000},{"$f":"IF(AND($AS$83>20,$AS$83<100),(BA84-AZ84)/80)","v":false},null,null,"hinzufügen","hinzufügen","fatigue life","Durée de vie"]
[null,null,null,null,null,null,null,null,null,null,null,null,null,null,null,null,null,null,null,null,null,null,null,null,null,null,null,null,null,null,null,null,null,null,null,null,null,null,null,null,null,null,null,{"$f":"($AR$83>AW85)*AT85","v":0},{"$f":"IF(AT85=1,IF($AS$83=20,AZ85,BJ85),0)","v":206000},{"$f":"IF($AT$99=2,1,0)","v":1},"1.8159 (51 CrV 4)","1.8159",25,-20,150,206000,202000,196000,null,null,null,null,null,{"$f":"($AS$83<AX85)*AT85","v":0},{"$f":"($AS$83>AY85)*AT85","v":0},{"$f":"IF($AS$83<=20,AZ85,IF(AND($AS$83>20,$AS$83<100),AZ85+($AS$83-20)*BK85,IF($AS$83=100,BA85,IF(AND($AS$83>100,$AS$83<200),BA85+($AS$83-100)*BK85,BB85))))","v":206000},{"$f":"IF(AND($AS$83>20,$AS$83<100),(BA85-AZ85)/80,IF(AND($AS$83>100,$AS$83<200),(BB85-BA85)/100))","v":false},null,null,"kopieren","kopieren","copy","Recopier"]
[null,null,null,null,null,null,null,null,null,null,null,null,null,null,null,null,null,null,null,null,null,null,null,null,null,null,null,null,null,null,null,null,null,null,null,null,null,null,null,null,null,null,null,0,{"$f":"IF(AT86=1,IF($AS$83=20,AZ86,BJ86),0)","v":0},{"$f":"IF($AT$99=3,1,0)","v":0},"1.7701 (52 CrMoV 4)","1.7701",40,-20,150,206000,202000,196000,null,null,null,null,null,0,0,{"$f":"IF($AS$83<=20,AZ86,IF(AND($AS$83>20,$AS$83<100),AZ86+($AS$83-20)*BK86,IF($AS$83=100,BA86,IF(AND($AS$83>100,$AS$83<200),BA86+($AS$83-100)*BK86,BB86))))","v":206000},{"$f":"IF(AND($AS$83>20,$AS$83<100),(BA86-AZ86)/80,IF(AND($AS$83>100,$AS$83<200),(BB86-BA86)/100))","v":false},null,null,"Standardabmessungen","Standardabmessungen","standard-dimensions","Dimensions standards"]
[null,null,null,null,null,null,null,null,null,null,null,null,null,null,null,null,null,null,null,null,null,null,null,null,null,null,null,null,null,null,null,null,null,null,null,null,null,null,null,null,null,null,null,0,0,{"$f":"IF($AT$99=4,1,0)","v":0},"1.4310 (X 10 CrNi 18-8)","1.4310",2,-150,200,190000,185000,178000,null,null,null,null,null,0,0,{"$f":"IF($AS$83<=20,AZ87,IF(AND($AS$83>20,$AS$83<100),AZ87+($AS$83-20)*BK87,IF($AS$83=100,BA87,IF(AND($AS$83>100,$AS$83<200),BA87+($AS$83-100)*BK87,BB87))))","v":190000},{"$f":"IF(AND($AS$83>20,$AS$83<100),(BA87-AZ87)/80,IF(AND($AS$83>100,$AS$83<200),(BB87-BA87)/100))","v":false},null,null,"Sonderabmessungen","Sonderabmessungen","extra-dimensions","Dimensions spéciales"]
[null,null,null,null,null,null,null,null,null,null,null,null,null,null,null,null,null,null,null,null,null,{"$f":"BN55","v":"Federweg in  mm"},null,null,null,null,null,null,null,null,null,null,null,null,null,null,null,null,null,null,null,null,null,0,0,{"$f":"IF($AT$99=5,1,0)","v":0},"1.4568 (X 7 CrNiAl 17 7)","1.4568",2.5,-200,200,200000,195000,190000,null,null,null,null,null,0,0,{"$f":"IF($AS$83<=20,AZ88,IF(AND($AS$83>20,$AS$83<100),AZ88+($AS$83-20)*BK88,IF($AS$83=100,BA88,IF(AND($AS$83>100,$AS$83<200),BA88+($AS$83-100)*BK88,BB88))))","v":200000},{"$f":"IF(AND($AS$83>20,$AS$83<100),(BA88-AZ88)/80,IF(AND($AS$83>100,$AS$83<200),(BB88-BA88)/100))","v":false},null,null,"Bestell-","Bestell-","order-","Numéro de"]
[null,null,null,null,null,null,null,null,null,null,null,null,null,null,null,null,null,null,null,null,null,null,null,null,null,null,null,null,null,null,null,null,null,null,null,null,null,null,null,null,null,null,null,0,0,{"$f":"IF($AT$99=6,1,0)","v":0},"1.4401 (X 5 CrNiMo 17-12-2)","1.4401",1.6,-200,200,190000,185000,178000,null,null,null,null,null,0,0,{"$f":"IF($AS$83<=20,AZ89,IF(AND($AS$83>20,$AS$83<100),AZ89+($AS$83-20)*BK89,IF($AS$83=100,BA89,IF(AND($AS$83>100,$AS$83<200),BA89+($AS$83-100)*BK89,BB89))))","v":190000},{"$f":"IF(AND($AS$83>20,$AS$83<100),(BA89-AZ89)/80,IF(AND($AS$83>100,$AS$83<200),(BB89-BA89)/100))","v":false},null,null,"Nr.:","Nr.:","no.:","référence"]
[null,{"$f":"$B$22","v":" "},null,null,null,null,null,null,null,{"$f":"$J$22","v":" "},null,null,null,{"$f":"$N$22","v":" "},null,null,null,{"$f":"$B$23","v":1},null,null,null,{"$f":"$F$23","v":"Feder"},null,null,null,{"$f":"$J$23","v":1},null,null,null,{"$f":"$N$23","v":" "},null,null,null,null,null,null,null,null,null,null,null,null,null,0,0,{"$f":"IF($AT$99=7,1,0)","v":0},"1.7737 (45 CrMoV 6 7)","1.7737",20,-60,250,206000,202000,196000,189000,null,null,null,null,0,0,{"$f":"IF($AS$83<=20,AZ90,IF(AND($AS$83>20,$AS$83<100),AZ90+($AS$83-20)*BK90,IF($AS$83=100,BA90,IF(AND($AS$83>100,$AS$83<200),BA90+($AS$83-100)*BK90,IF($AS$83=200,BB90,IF(AND($AS$83>200,$AS$83<300),BB90+($AS$83-200)*BK90,BC90))))))","v":206000},{"$f":"IF(AND($AS$83>20,$AS$83<100),(BA90-AZ90)/80,IF(AND($AS$83>100,$AS$83<200),(BB90-BA90)/100,IF(AND($AS$83>200,$AS$83<300),(BC90-BB90)/100)))","v":false},null,null,"Masse 1000 Stück","Masse 1000 Stück","weight of 1000 pcs.","Poids au 1000 pcs"]
[null,{"$f":"$B$13","v":"Tellerfederabmessung"},null,null,null,null,null,null,null,null,null,null,null,null,null,null,null,null,null,null,null,null,null,null,null,null,null,null,{"$f":"$AE$24","v":"Lastpunkte"},null,null,null,null,null,null,null,null,null,null,null,null,null,null,0,0,{"$f":"IF($AT$99=8,1,0)","v":0},"1.6580 (30 CrNiMo 8)","1.6580",20,-80,250,206000,202000,196000,189000,null,null,null,null,0,0,{"$f":"IF($AS$83<=20,AZ91,IF(AND($AS$83>20,$AS$83<100),AZ91+($AS$83-20)*BK91,IF($AS$83=100,BA91,IF(AND($AS$83>100,$AS$83<200),BA91+($AS$83-100)*BK91,IF($AS$83=200,BB91,IF(AND($AS$83>200,$AS$83<300),BB91+($AS$83-200)*BK91,BC91))))))","v":206000},{"$f":"IF(AND($AS$83>20,$AS$83<100),(BA91-AZ91)/80,IF(AND($AS$83>100,$AS$83<200),(BB91-BA91)/100,IF(AND($AS$83>200,$AS$83<300),(BC91-BB91)/100)))","v":false},null,null,"Werkzeuge vorhanden","Werkzeuge vorhanden","tooling prepared","outillage existant"]
[null,{"$f":"$B$14","v":"Außendurchm.:"},null,null,null,null,null,"De=",null,null,{"$f":"$J$14","v":8},null,null,null,null,null,null,{"$f":"$AT$53","v":" mm"},null,null,null,null,null,null,null,null,null,null,{"$f":"$AE$25","v":"der Einzelfeder"},null,null,null,null,null,null,null,null,null,null,null,null,null,null,0,0,{"$f":"IF($AT$99=9,1,0)","v":0},"1.4122 (X 39 CrMo 17-1)","1.4122",8,-60,300,209000,205000,199000,192000,null,null,null,null,0,0,{"$f":"IF($AS$83<=20,AZ92,IF(AND($AS$83>20,$AS$83<100),AZ92+($AS$83-20)*BK92,IF($AS$83=100,BA92,IF(AND($AS$83>100,$AS$83<200),BA92+($AS$83-100)*BK92,IF($AS$83=200,BB92,IF(AND($AS$83>200,$AS$83<300),BB92+($AS$83-200)*BK92,BC92))))))","v":209000},{"$f":"IF(AND($AS$83>20,$AS$83<100),(BA92-AZ92)/80,IF(AND($AS$83>100,$AS$83<200),(BB92-BA92)/100,IF(AND($AS$83>200,$AS$83<300),(BC92-BB92)/100)))","v":false},null,null,"Spannung","Spannung","stress","Contraintes"]
[null,{"$f":"$B$15","v":"Innendurchm.:"},null,null,null,null,null,"Di=",null,null,{"$f":"$J$15","v":3.2},null,null,null,null,null,null,{"$f":"$AT$53","v":" mm"},null,null,null,null,null,null,null,null,null,null,{"$f":"$B$26","v":"Last-"},null,null,{"$f":"$AE$26","v":"Länge l"},null,null,null,null,{"$f":"$AI$26","v":"Weg s"},null,null,{"$f":"$AM$26","v":"Kraft F"},null,null,null,0,0,{"$f":"IF($AT$99=10,1,0)","v":0},"1.2567 (X 30 WCrV 5 3)","1.2567",20,-60,350,206000,202000,196000,189000,178000,null,null,null,0,0,{"$f":"IF($AS$83<=20,AZ93,IF(AND($AS$83>20,$AS$83<100),AZ93+($AS$83-20)*BK93,IF($AS$83=100,BA93,IF(AND($AS$83>100,$AS$83<200),BA93+($AS$83-100)*BK93,IF($AS$83=200,BB93,IF(AND($AS$83>200,$AS$83<300),BB93+($AS$83-200)*BK93,BL93))))))","v":206000},{"$f":"IF(AND($AS$83>20,$AS$83<100),(BA93-AZ93)/80,IF(AND($AS$83>100,$AS$83<200),(BB93-BA93)/100,IF(AND($AS$83>200,$AS$83<300),(BC93-BB93)/100,IF(AND($AS$83>300,$AS$83<400),(BD93-BC93)/100))))","v":false},{"$f":"IF($AS$83=300,BC93,IF(AND($AS$83>300,$AS$83<400),BC93+($AS$83-300)*BK93,BD93))","v":178000},null,"in","in","in","en"]
[null,{"$f":"$B$16","v":"Blechdicke:"},null,null,null,null,null,"t=",null,null,{"$f":"$J$16","v":0.3},null,null,null,null,null,null,{"$f":"$AT$53","v":" mm"},null,null,null,null,null,null,null,null,null,null,{"$f":"$B$27","v":"punkt"},null,null,{"$f":"$AT$53","v":" mm"},null,null,null,null,{"$f":"$AT$53","v":" mm"},null,null,{"$f":"$AT$54","v":" N"},null,null,null,0,0,{"$f":"IF($AT$99=11,1,0)","v":0},"1.4923 (X 22 CrMoV 12 1)","1.4923",8,-60,350,209000,205000,200000,193000,null,null,null,null,0,0,{"$f":"IF($AS$83<=20,AZ94,IF(AND($AS$83>20,$AS$83<100),AZ94+($AS$83-20)*BK94,IF($AS$83=100,BA94,IF(AND($AS$83>100,$AS$83<200),BA94+($AS$83-100)*BK94,IF($AS$83=200,BB94,IF(AND($AS$83>200,$AS$83<300),BB94+($AS$83-200)*BK94,BC94))))))","v":209000},{"$f":"IF(AND($AS$83>20,$AS$83<100),(BA94-AZ94)/80,IF(AND($AS$83>100,$AS$83<200),(BB94-BA94)/100,IF(AND($AS$83>200,$AS$83<300),(BC94-BB94)/100)))","v":false},null,null,"Gruppe 3 mit Auflageflächen","Gruppe 3 mit Auflageflächen","group 3 including load input surfaces","Groupe 3"]
[null,{"$f":"$B$17","v":"red. Blechdicke:"},null,null,null,null,null,"t'=",null,null,{"$f":"$J$17","v":0.3},null,null,null,null,null,null,{"$f":"$AT$53","v":" mm"},null,null,null,null,null,null,null,null,null,null,{"$f":"$B$28","v":0},null,null,null,{"$f":"$AE$28","v":0.55000000000000004},null,null,{"$f":"$AL$28","v":0},null,null,null,{"$f":"$AP$28","v":0},null,null,null,0,0,{"$f":"IF($AT$99=12,1,0)","v":0},"2.1247 (CuBe 2)","2.1247",3,-250,150,135000,131000,126000,null,null,null,null,null,0,0,{"$f":"IF($AS$83<=20,AZ95,IF(AND($AS$83>20,$AS$83<100),AZ95+($AS$83-20)*BK95,IF($AS$83=100,BA95,IF(AND($AS$83>100,$AS$83<200),BA95+($AS$83-100)*BK95,BB95))))","v":135000},{"$f":"IF(AND($AS$83>20,$AS$83<100),(BA95-AZ95)/80,IF(AND($AS$83>100,$AS$83<200),(BB95-BA95)/100))","v":false},null,null,"Berechnungen","Berechnungen","calculations","calcul"]
[null,{"$f":"$B$18","v":"Federhöhe:"},null,null,null,null,null,"l0=",null,null,{"$f":"$J$18","v":0.55000000000000004},null,null,null,null,null,null,{"$f":"$AT$53","v":" mm"},null,null,null,null,null,null,null,null,null,null,{"$f":"IF($AQ$41=0,B$28,IF($AQ$41=1,B$29,IF($AQ$41=2,B$30,IF($AQ$41=3,B$31,IF($AQ$41=4,#REF!,IF($AQ$41=5,#REF!,IF(OR($AQ$41=\"c\",$AQ$41=\"C\"),B$34)))))))","v":1},null,null,null,{"$f":"IF($AQ$41=0,AE$28,IF($AQ$41=1,AE$29,IF($AQ$41=2,AE$30,IF($AQ$41=3,AE$31,IF($AQ$41=4,AE$32,IF($AQ$41=5,AE$33,IF(OR($AQ$41=\"c\",$AQ$41=\"C\"),AE$34)))))))","v":0.48800000000000004},null,null,{"$f":"IF($AQ$41=0,AL$28,IF($AQ$41=1,AI$29,IF($AQ$41=2,AI$30,IF($AQ$41=3,AI$31,IF($AQ$41=4,AI$32,IF($AQ$41=5,AI$33,IF(OR($AQ$41=\"c\",$AQ$41=\"C\"),AI$34)))))))","v":6.2E-2},null,null,null,{"$f":"IF($AQ$41=0,AP$28,IF($AQ$41=1,AM$29,IF($AQ$41=2,AM$30,IF($AQ$41=3,AM$31,IF($AQ$41=4,AM$32,IF($AQ$41=5,AM$33,IF(OR($AQ$41=\"c\",$AQ$41=\"C\"),AM$34)))))))","v":45.37221045222546},null,null,null,{"$f":"($AR$83>AW96)*AT96","v":0},{"$f":"IF(AT96=1,IF($AS$83=20,AZ96,BJ96),0)","v":0},{"$f":"IF($AT$99=13,1,0)","v":0},"2.4668 (Inconel 718)","2.4668",8,-200,500,200000,196000,190000,186000,179000,172000,null,null,{"$f":"($AS$83<AX96)*AT96","v":0},{"$f":"($AS$83>AY96)*AT96","v":0},{"$f":"IF($AS$83<=20,AZ96,IF(AND($AS$83>20,$AS$83<100),AZ96+($AS$83-20)*BK96,IF($AS$83=100,BA96,IF(AND($AS$83>100,$AS$83<200),BA96+($AS$83-100)*BK96,IF($AS$83=200,BB96,IF(AND($AS$83>200,$AS$83<300),BB96+($AS$83-200)*BK96,BL96))))))","v":200000},{"$f":"IF(AND($AS$83>20,$AS$83<100),(BA96-AZ96)/80,IF(AND($AS$83>100,$AS$83<200),(BB96-BA96)/100,IF(AND($AS$83>200,$AS$83<300),(BC96-BB96)/100,IF(AND($AS$83>300,$AS$83<400),(BD96-BC96)/100,IF(AND($AS$83>400,$AS$83<500),(BE96-BD96)/100)))))","v":false},{"$f":"IF($AS$83=300,BC96,IF(AND($AS$83>300,$AS$83<400),BC96+($AS$83-300)*BK96,IF($AS$83=400,BD96,IF(AND($AS$83>400,$AS$83<500),BD96+($AS$83-400)*BK96,BE96))))","v":172000},null,"in N",{"$f":"\"in\"&$AT$54","v":"in N"},{"$f":"\"in\"&$AT$54","v":"in N"},{"$f":"\"en\"&$AT$54","v":"en N"}]
[null,{"$f":"$B$36","v":"Werkstoff:"},null,null,null,null,null,{"$f":"$N$36","v":"1.8159 (51 CrV 4)"},null,null,null,null,null,null,null,null,null,null,null,null,null,null,null,null,null,null,null,null,{"$f":"IF($AQ$42=0,B$28,IF($AQ$42=1,B$29,IF($AQ$42=2,B$30,IF($AQ$42=3,B$31,IF($AQ$42=4,#REF!,IF($AQ$42=5,#REF!,IF(OR($AQ$42=\"c\",$AQ$42=\"C\"),B$34)))))))","v":2},null,null,null,{"$f":"IF($AQ$42=0,AE$28,IF($AQ$42=1,AE$29,IF($AQ$42=2,AE$30,IF($AQ$42=3,AE$31,IF($AQ$42=4,AE$32,IF($AQ$42=5,AE$33,IF(OR($AQ$42=\"c\",$AQ$42=\"C\"),AE$34)))))))","v":0.36300000000000004},null,null,{"$f":"IF($AQ$42=0,AL$28,IF($AQ$42=1,AI$29,IF($AQ$42=2,AI$30,IF($AQ$42=3,AI$31,IF($AQ$42=4,AI$32,IF($AQ$42=5,AI$33,IF(OR($AQ$42=\"c\",$AQ$42=\"C\"),AI$34)))))))","v":0.187},null,null,null,{"$f":"IF($AQ$42=0,AP$28,IF($AQ$42=1,AM$29,IF($AQ$42=2,AM$30,IF($AQ$42=3,AM$31,IF($AQ$42=4,AM$32,IF($AQ$42=5,AM$33,IF(OR($AQ$42=\"c\",$AQ$42=\"C\"),AM$34)))))))","v":104.18089923367049},null,null,null,{"$f":"($AR$83>AW97)*AT97","v":0},{"$f":"IF(AT97=1,IF($AS$83=20,AZ97,BJ97),0)","v":0},{"$f":"IF($AT$99=14,1,0)","v":0},"2.4669 (Inconel X 750)","2.4669",8,-200,500,214000,207000,198000,190000,179000,170000,null,null,{"$f":"($AS$83<AX97)*AT97","v":0},{"$f":"($AS$83>AY97)*AT97","v":0},{"$f":"IF($AS$83<=20,AZ97,IF(AND($AS$83>20,$AS$83<100),AZ97+($AS$83-20)*BK97,IF($AS$83=100,BA97,IF(AND($AS$83>100,$AS$83<200),BA97+($AS$83-100)*BK97,IF($AS$83=200,BB97,IF(AND($AS$83>200,$AS$83<300),BB97+($AS$83-200)*BK97,BL97))))))","v":214000},{"$f":"IF(AND($AS$83>20,$AS$83<100),(BA97-AZ97)/80,IF(AND($AS$83>100,$AS$83<200),(BB97-BA97)/100,IF(AND($AS$83>200,$AS$83<300),(BC97-BB97)/100,IF(AND($AS$83>300,$AS$83<400),(BD97-BC97)/100,IF(AND($AS$83>400,$AS$83<500),(BE97-BD97)/100)))))","v":false},{"$f":"IF($AS$83=300,BC97,IF(AND($AS$83>300,$AS$83<400),BC97+($AS$83-300)*BK97,IF($AS$83=400,BD97,IF(AND($AS$83>400,$AS$83<500),BD97+($AS$83-400)*BK97,BE97))))","v":170000},null,"Weg: ","Weg: ","travel: ","Course: "]
[null,{"$f":"$X$36","v":"E-Modul:"},null,null,null,null,null,{"$f":"$AE$36","v":206000},null,null,null,null,{"$f":"$AT$59","v":"MPa"},null,null,null,{"$f":"$BN$51","v":"bei"},null,null,null,{"$f":"$AE$37","v":20},null,null,null,{"$f":"$AL$37","v":"°C"},null,null,null,null,{"$f":"$B$34","v":"Plan"},null,null,{"$f":"$AE$34","v":0.3},null,null,{"$f":"$AI$34","v":0.25000000000000006},null,null,null,{"$f":"$AM$34","v":125.52771578600478},null,null,null,{"$f":"($AR$83>AW98)*AT98","v":0},{"$f":"IF(AT98=1,IF($AS$83=20,AZ98,BJ98),0)","v":0},{"$f":"IF($AT$99=15,1,0)","v":0},"2.4632 (Nimonic 90)","2.4632",8,-200,600,206000,201000,195000,189000,181000,175000,167000,160000,{"$f":"($AS$83<AX98)*AT98","v":0},{"$f":"($AS$83>AY98)*AT98","v":0},{"$f":"IF($AS$83<=20,AZ98,IF(AND($AS$83>20,$AS$83<100),AZ98+($AS$83-20)*BK98,IF($AS$83=100,BA98,IF(AND($AS$83>100,$AS$83<200),BA98+($AS$83-100)*BK98,IF($AS$83=200,BB98,IF(AND($AS$83>200,$AS$83<300),BB98+($AS$83-200)*BK98,BL98))))))","v":206000},{"$f":"IF(AND($AS$83>20,$AS$83<100),(BA98-AZ98)/80,IF(AND($AS$83>100,$AS$83<200),(BB98-BA98)/100,IF(AND($AS$83>200,$AS$83<300),(BC98-BB98)/100,IF(AND($AS$83>300,$AS$83<400),(BD98-BC98)/100,IF(AND($AS$83>400,$AS$83<700),(BG98-BD98)/300)))))","v":false},{"$f":"IF($AS$83=300,BC98,IF(AND($AS$83>300,$AS$83<400),BC98+($AS$83-300)*BK98,IF($AS$83=400,BD98,IF(AND($AS$83>400,$AS$83<700),BD98+($AS$83-400)*BK98,BG98))))","v":160000},null,{"$f":"IF($AQ$2=1,BO98,IF($AQ$2=2,BP98,IF($AQ$2=3,BQ98,\"Wrong language selection\")))","v":"Punkte 1 bis 5"},"Punkte 1 bis 5","points 1 to 5","Points 1 à 5"]
[null,null,null,null,null,null,null,null,null,null,null,null,null,null,null,null,null,null,null,null,null,null,null,null,null,null,null,null,null,null,null,null,null,null,null,null,null,null,null,null,null,null,null,{"$f":"SUM(AR84:AR98)","v":0},{"$f":"SUM(AS84:AS98)","v":206000},2,{"$f":"INDEX(AU84:AU98,AT99)","v":"1.8159 (51 CrV 4)"},null,{"$f":"IF($AT$99=16,$AU$98)","v":false},null,null,{"$f":"INDEX(AZ84:AZ98,AT99)","v":206000},null,null,null,null,null,null,null,{"$f":"SUM(BH84:BH98)","v":0},{"$f":"SUM(BI84:BI98)","v":0},null,null,null,null,"Federrate","Federrate","stiffness","Raideur"]
[null,null,null,null,null,null,null,null,{"$f":"$BN$2","v":"Berechnung von Tellerfedern"},null,null,null,null,null,null,null,null,null,null,null,null,null,null,null,null,null,null,null,null,{"$f":"IF($AT$4<1.25,$BN$3,IF($AT$4=$AT$5,$BN$108,$BN$94))","v":"Gruppe 1"},null,null,null,null,null,null,null,null,null,null,null,null,null,null,null,null,null,null,null,null,null,null,null,null,null,null,null,null,null,null,null,null,null,null,null,"in MPa",{"$f":"\"in \"&$AT$55","v":"in MPa"},{"$f":"\"in \"&$AT$55","v":"in MPa"},{"$f":"\"in \"&$AT$55","v":"in MPa"}]
[null,null,null,null,null,null,null,null,{"$f":"$BN$4","v":"Teile/Zeichn. Nr.:"},null,null,null,null,null,{"$f":"IF(ISBLANK($O$2),\"\",$O$2)","v":"17 0001"},null,null,null,null,null,null,null,null,null,null,{"$f":"$BN$174","v":"Revision"},null,null,null,{"$f":"IF(ISBLANK($AD$2),\"\",$AD$2)","v":""},null,null,null,null,null,null,null,null,null,null,null,null,null,null,null,null,null,null,null,null,null,null,null,null,null,null,null,null,null,null,null,null,null,null,null,"Anzeige der","Anzeige der","show","Indication des"]
[null,{"$f":"IF(ISBLANK($B$3),\"\",$B$3)","v":"K-Version 10.03.22"},null,null,null,null,null,null,{"$f":"$BN$5","v":"Projekt:"},null,null,null,null,null,{"$f":"IF(ISBLANK($O$3),\"\",$O$3)","v":""},null,null,null,null,null,null,null,null,null,null,{"$f":"$BN$175","v":"Kunde"},null,null,null,{"$f":"IF(ISBLANK($AD$3),\"\",$AD$3)","v":""},null,null,null,null,null,null,null,null,null,null,null,null,null,null,null,null,null,null,null,null,null,null,null,null,null,null,null,null,null,null,null,null,null,null,null,"Spannungen","Spannungen","stresses","Contraintes"]
[null,{"$f":"$B$4","v":"2022-03-10T14:18:38.430"},null,null,null,null,null,null,"Mubea Tellerfedern GmbH, Postfach 120, 57564 Daaden",null,null,null,null,null,null,null,null,null,null,null,null,null,null,null,null,null,null,null,null,null,null,null,null,null,null,null,null,null,null,null,null,null,null,null,null,null,null,null,null,null,null,null,null,null,null,null,null,null,null,null,null,null,null,null,null,"0 = nein, 1 = ja","0 = nein, 1 = ja","0 = no, 1 = yes","0 = non, 1 = oui"]
[null,{"$f":"IF(ISBLANK($B$5),\"\",$B$5)","v":""},null,null,null,null,null,null,{"$f":"$BN$107","v":"Tel.: Vertrieb: +49 2743/806- 3588, -3593, -3625; Entwicklung: +49 2743/806-3510"},null,null,null,null,null,null,null,null,null,null,null,null,null,null,null,null,null,null,null,null,null,null,null,null,null,null,null,null,null,null,null,null,null,null,null,null,null,null,null,null,null,null,null,null,null,null,null,null,null,null,null,null,null,null,null,null,"DIN-Toleranz der Federkraft:","DIN-Toleranz der Federkraft:","Load DIN-tolerance:","Tolérances DIN sur force: "]
[null,null,null,null,null,null,null,null,null,null,null,null,null,null,null,null,null,null,null,null,null,null,null,null,null,null,null,null,null,null,null,null,null,null,null,null,null,null,null,null,null,null,null,null,null,null,null,null,null,null,null,null,null,null,null,null,null,null,null,null,null,null,null,null,null,"bei 75% von h0 einer Feder","bei 75% von h0 einer Feder","at 75% of h0 of one spring","à 75% de ho pour une rondelle seule"]
[null,{"$f":"$BN$21","v":"Lastpunkte"},null,null,null,null,null,null,null,null,null,null,null,{"$f":"$BN$29","v":"rechnerische"},null,null,null,null,null,null,null,null,null,null,null,null,{"$f":"$BN$21","v":"Lastpunkte"},null,null,null,null,null,null,null,null,null,null,null,null,null,null,null,null,null,null,null,null,null,null,null,null,null,null,null,null,null,null,null,null,null,null,null,null,null,null,0,null,null,"Ces calculs ont été effectués par Mubea avec les paramêtres qui lui ont été fournies et Mubea ne s'engage que surla base de ceux-ci."]
[null,{"$f":"$BN$22","v":"der Einzelfeder"},null,null,null,null,null,null,null,null,null,null,null,{"$f":"$BN$30","v":"Randspannungen"},null,null,null,null,null,null,null,null,null,null,null,null,{"$f":"IF(($J$23*$B$23)>1,$BN$32,$BN$33)","v":"der Einzelfeder"},null,null,null,null,null,null,null,null,null,null,null,null,null,null,null,null,null,null,null,null,null,null,null,null,null,null,null,null,null,null,null,null,null,null,null,null,null,null,"Tel.: Vertrieb: +49 2743/806- 3588, -3593, -3625; Entwicklung: +49 2743/806-3510",{"$f":"CONCATENATE(\"Tel.: Vertrieb: +49 2743/806- 3588, -3593, -3625; Entwicklung: +49 2743/806-\",$AS$29)","v":"Tel.: Vertrieb: +49 2743/806- 3588, -3593, -3625; Entwicklung: +49 2743/806-3510"},{"$f":"CONCATENATE(\"phone: sales: +49 2743/806- 3588, -3593, -3625; engineering: +49 2743/806-\",$AS$29)","v":"phone: sales: +49 2743/806- 3588, -3593, -3625; engineering: +49 2743/806-3510"},{"$f":"CONCATENATE(\"Tel.: Sce de Vente: +49 2743/806- 3588, -3593, -3625; Bur. d'Etudes: +49 2743/806-\",$AS$29)","v":"Tel.: Sce de Vente: +49 2743/806- 3588, -3593, -3625; Bur. d'Etudes: +49 2743/806-3510"}]
[null,{"$f":"$BN$25","v":"Höhe l"},null,null,null,{"$f":"$BN$26","v":"Weg s"},null,null,null,{"$f":"$BN$27","v":"Kraft F"},null,null,null,"σI",null,null,null,"σII",null,null,"σIII",null,null,"σOM",null,null,{"$f":"$BN$31","v":"Länge l"},null,null,null,{"$f":"$BN$26","v":"Weg s"},null,null,null,{"$f":"$BN$27","v":"Kraft F"},null,null,null,{"$f":"$BN$99","v":"Federrate"},null,null,null,null,"k","k_sigma",{"$f":"IF($AQ$70=1,\"σ I\",\" \")","v":"σ I"},{"$f":"IF($AQ$70=1,\"σ II\",\" \")","v":"σ II"},{"$f":"IF($AQ$70=1,\"σ III\",\" \")","v":"σ III"},{"$f":"IF($AQ$70=1,\"σ OM\",\" \")","v":"σ OM"},null,null,null,null,null,null,null,null,null,null,null,null,null,null,null,null,"Gruppe 2","Gruppe 2","group 2","Groupe 2"]
[null,{"$f":"$AT$53","v":" mm"},null,null,null,{"$f":"$AT$53","v":" mm"},null,null,null,{"$f":"$AT$54","v":" N"},null,null,null,{"$f":"$AT$55","v":"MPa"},null,null,null,null,null,null,null,null,null,null,null,null,{"$f":"$AT$53","v":" mm"},null,null,null,{"$f":"$AT$53","v":" mm"},null,null,null,{"$f":"$AT$54","v":" N"},null,null,null,{"$f":"$AT$57","v":"N/mm"},null,null,null,null,null,null,"N/mm2","N/mm2","N/mm2","N/mm2",null,null,null,null,null,null,null,null,null,null,null,null,null,null,null,null,"Blechdicke zu groß","Blechdicke zu groß","material thickness too big","Epaisseur trop importante"]
[null,{"$f":"IF(ISBLANK($AQ$14),$J$18,$J$18-$AQ$14)","v":0.55000000000000004},null,null,null,{"$f":"$J$18-B110","v":0},null,null,null,{"$f":"$AX$5*$AT$5^3*F110*$AT$51*$AY$12*$AY$12/$AV$3/$AT$1^2*AR110/$AT$52","v":0},null,null,null,{"$f":"-$AX$5*$AT$5/$AV$3/$AT$1^2*F110*$AT$51*$AY$12*($AX$3*($AY$13/$AT$5-F110*$AT$51*$AY$12/2/$AT$5)+$AX$4)*$AT$56","v":0},null,null,null,{"$f":"-$AX$5*$AT$5/$AV$3/$AT$1^2*F110*$AT$51*$AY$12*($AX$3*($AY$13/$AT$5-F110*$AT$51*$AY$12/2/$AT$5)-$AX$4)*$AT$56","v":0},null,null,{"$f":"-$AX$5*$AT$5/$AV$3/$AT$1^2*F110*$AT$51*$AY$12/$AV$2*(($AX$3-2*$AX$4)*($AY$13/$AT$5-F110*$AT$51*$AY$12/2/$AT$5)-$AX$4)*$AT$56","v":0},null,null,{"$f":"-3*$AX$5*$AT$5/$AV$3/$AT$1^2*F110*$AT$51*$AY$12/$AV$5*$AT$56","v":0},null,null,{"$f":"(B110+($J$23-1)*$J$17)*$B$23","v":0.55000000000000004},null,null,null,{"$f":"F110*$B$23","v":0},null,null,null,{"$f":"J110*$J$23","v":0},null,null,null,{"$f":"$J$23/$B$23*($AX$5*$AT$5^3/$AV$3/$AT$1^2*$AY$12*$AY$12*(($AY$13/$AT$5)^2-3*$AY$13/$AT$5*F110*$AT$51*$AY$12/$AT$5+3/2*(F110*$AT$51*$AY$12/$AT$5)^2+1)*$AT$58)","v":850.79896254958794},null,null,null,null,{"$f":"($AY$13/$AT$5-F110*$AT$51*$AY$12/$AT$5)*($AY$13/$AT$5-F110*$AT$51*$AY$12/2/$AT$5)+$AV$4","v":1.6944444444444449},{"$f":"IF($AQ$70=1,1,0)","v":1},{"$f":"N110*$AS$110","v":0},{"$f":"R110*$AS$110","v":0},{"$f":"U110*$AS$110","v":0},{"$f":"X110*$AS$110","v":0},{"$f":"AE110*$AS$110","v":0},null,null,null,null,null,null,null,null,null,null,null,null,null,null,null,"Durchmessertol. innen:","Durchmessertol. innen:","tolerance inner diam.:","Tolérances sur Dia. int."]
[null,{"$f":"B110-($B$110-$B$135)/25","v":0.54},null,null,null,1.0000000000000009E-2,null,null,null,8.3015662706477915,null,null,null,-147.7109774439202,null,null,null,{"$f":"-$AX$5*$AT$5/$AV$3/$AT$1^2*F111*$AT$51*$AY$12*($AX$3*($AY$13/$AT$5-F111*$AT$51*$AY$12/2/$AT$5)-$AX$4)*$AT$56","v":26.717122873227421},null,null,67.666695252892538,null,null,-53.27561723300591,null,null,0.54,null,null,null,1.0000000000000009E-2,null,null,null,8.3015662706477915,null,null,null,809.79324205949297,null,null,null,null,1.6533333333333338,null,-147.7109774439202,26.717122873227421,67.666695252892538,-53.27561723300591,1.0000000000000009E-2,null,null,null,null,null,null,null,null,null,null,null,null,null,null,null,"Durchmessertol. außen:","Durchmessertol. außen:","tolerance outer diam.:","Tolérances sur Dia. ext."]
[null,0.53,null,null,null,2.0000000000000018E-2,null,null,null,16.201443850780368,null,null,null,-292.95269254966303,null,null,null,{"$f":"-$AX$5*$AT$5/$AV$3/$AT$1^2*F112*$AT$51*$AY$12*($AX$3*($AY$13/$AT$5-F112*$AT$51*$AY$12/2/$AT$5)-$AX$4)*$AT$56","v":55.903508084632229},null,null,133.99538743682743,null,null,-106.55123446601182,null,null,0.53,null,null,null,2.0000000000000018E-2,null,null,null,16.201443850780368,null,null,null,770.46122444654486,null,null,null,null,1.6133333333333337,null,-292.95269254966303,55.903508084632229,133.99538743682743,-106.55123446601182,2.0000000000000018E-2,null,null,null,null,null,null,null,null,null,null,null,null,null,null,null,"Gesamtspiel innen:","Gesamtspiel innen:","gap at inner diam.:","Guide int. : jeu total"]
[null,0.52,null,null,null,3.0000000000000027E-2,null,null,null,23.716369769169191,null,null,null,-435.72514531722845,null,null,null,87.559155634214477,null,null,198.98607655180462,null,null,-159.82685169901774,null,null,0.52,null,null,null,3.0000000000000027E-2,null,null,null,23.716369769169191,null,null,null,732.80290971074328,null,null,null,null,1.5744444444444448,null,-435.72514531722845,87.559155634214477,198.98607655180462,-159.82685169901774,3.0000000000000027E-2,null,null,null,null,null,null,null,null,null,null,null,null,null,null,null,"Gesamtspiel außen:","Gesamtspiel außen:","gap at outer diam.:","Guide ext. : jeu total"]
[null,0.51,null,null,null,4.0000000000000036E-2,null,null,null,30.863081054585741,null,null,null,-576.02833574661645,null,null,null,121.68406552197412,null,null,262.6387625978241,null,null,-213.10246893202364,null,null,0.51,null,null,null,4.0000000000000036E-2,null,null,null,30.863081054585741,null,null,null,696.81829785208856,null,null,null,null,1.5366666666666671,null,-576.02833574661645,121.68406552197412,262.6387625978241,-213.10246893202364,4.0000000000000036E-2,null,null,null,null,null,null,null,null,null,null,null,null,null,null,null,"Toleranz der Blechdicke:","Toleranz der Blechdicke:","tolerance of thickness:","Tolérances sur épaisseur:"]
[null,0.5,null,null,null,5.0000000000000044E-2,null,null,null,37.658314735801468,null,null,null,-713.86226383782696,null,null,null,158.27823774791113,null,null,324.95344557488596,null,null,-266.37808616502957,null,null,0.5,null,null,null,5.0000000000000044E-2,null,null,null,37.658314735801468,null,null,null,662.5073888705806,null,null,null,null,1.5000000000000002,null,-713.86226383782696,158.27823774791113,324.95344557488596,-266.37808616502957,5.0000000000000044E-2,null,null,null,null,null,null,null,null,null,null,null,null,null,null,null,"Toleranz der Federhöhe:","Toleranz der Federhöhe:","tolerance of spring height:","Tolérances sur hauteur:"]
[null,0.49,null,null,null,6.0000000000000053E-2,null,null,null,44.118807841587852,null,null,null,-849.22692959086021,null,null,null,197.34167231202562,null,null,385.93012548299009,null,null,-319.65370339803547,null,null,0.49,null,null,null,6.0000000000000053E-2,null,null,null,44.118807841587852,null,null,null,629.87018276621927,null,null,null,null,1.4644444444444447,null,-849.22692959086021,197.34167231202562,385.93012548299009,-319.65370339803547,6.0000000000000053E-2,null,null,null,null,null,null,null,null,null,null,null,null,null,null,null,"proz. min. Entl. Kraft:","proz. min. Entl. Kraft:","rel. min. load at disloading:","% min de force à la décomp."]
[null,0.48,null,null,null,7.0000000000000062E-2,null,null,null,50.261297400716352,null,null,null,-982.12233300571586,null,null,null,238.87436921431748,null,null,445.56880232213666,null,null,-372.92932063104132,null,null,0.48,null,null,null,7.0000000000000062E-2,null,null,null,50.261297400716352,null,null,null,598.90667953900481,null,null,null,null,1.4300000000000002,null,-982.12233300571586,238.87436921431748,445.56880232213666,-372.92932063104132,7.0000000000000062E-2,null,null,null,null,null,null,null,null,null,null,null,null,null,null,null,"bei 75% von h0 der Säule","bei 75% von h0 der Säule","at 75% of h0 of the stack","à 75% de la course tot. ho de l'empilage"]
[null,0.47,null,null,null,8.0000000000000071E-2,null,null,null,56.102520441958447,null,null,null,-1112.5484740823943,null,null,null,282.87632845478669,null,null,503.8694760923255,null,null,-426.20493786404728,null,null,0.47,null,null,null,8.0000000000000071E-2,null,null,null,56.102520441958447,null,null,null,569.61687918893699,null,null,null,null,1.3966666666666667,null,-1112.5484740823943,282.87632845478669,503.8694760923255,-426.20493786404728,8.0000000000000071E-2,null,null,null,null,null,null,null,null,null,null,null,null,null,null,null,"Spannungen Sigma2 und Sigma3 sind stark unterschiedlich! Material könnte besser ausgenutzt werden.","Spannungen Sigma2 und Sigma3 sind stark unterschiedlich! Material könnte besser ausgenutzt werden.","Stresses sigma 2 and sigma 3 differ very much! Material may be better used.","Contraintes Sigma 2 et Sigma 3 très différentes"]
[null,0.45999999999999996,null,null,null,9.000000000000008E-2,null,null,null,61.65921399408559,null,null,null,-1240.5053528208955,null,null,null,329.34755003343338,null,null,560.8321467935566,null,null,-479.48055509705318,null,null,0.45999999999999996,null,null,null,9.000000000000008E-2,null,null,null,61.65921399408559,null,null,null,542.00078171601581,null,null,null,null,1.3644444444444446,null,-1240.5053528208955,329.34755003343338,560.8321467935566,-479.48055509705318,9.000000000000008E-2,null,null,null,null,null,null,null,null,null,null,null,null,null,null,null,"zul. Oberspannung:","zul. Oberspannung:","max upper stress:","Contrainte sup. admissible"]
[null,0.44999999999999996,null,null,null,0.10000000000000009,null,null,null,66.948115085869262,null,null,null,-1365.9929692212188,null,null,null,378.28803395025744,null,null,616.45681442583009,null,null,-532.75617233005914,null,null,0.44999999999999996,null,null,null,0.10000000000000009,null,null,null,66.948115085869262,null,null,null,516.0583871202416,null,null,null,null,1.3333333333333333,null,-1365.9929692212188,378.28803395025744,616.45681442583009,-532.75617233005914,0.10000000000000009,null,null,null,null,null,null,null,null,null,null,null,null,null,null,null,"zul Druckspannung:","zul Druckspannung:","max compress. stress:","Contrainte de pression admissible"]
[null,0.43999999999999995,null,null,null,0.1100000000000001,null,null,null,71.98596074608092,null,null,null,-1489.0113232833648,null,null,null,429.69778020525882,null,null,670.74347898914584,null,null,-586.03178956306499,null,null,0.43999999999999995,null,null,null,0.1100000000000001,null,null,null,71.98596074608092,null,null,null,491.78969540161398,null,null,null,null,1.3033333333333332,null,-1489.0113232833648,429.69778020525882,670.74347898914584,-586.03178956306499,0.1100000000000001,null,null,null,null,null,null,null,null,null,null,null,null,null,null,null,"ber. Lebensdauer:","ber. Lebensdauer:","calc. fatigue life:","Durée de vie théorigue"]
[null,0.42999999999999994,null,null,null,0.12000000000000011,null,null,null,76.789488003492053,null,null,null,-1609.5604150073336,null,null,null,483.5767887984378,null,null,723.69214048350386,null,null,-639.30740679607095,null,null,0.42999999999999994,null,null,null,0.12000000000000011,null,null,null,76.789488003492053,null,null,null,469.19470656013306,null,null,null,null,1.2744444444444445,null,-1609.5604150073336,483.5767887984378,723.69214048350386,-639.30740679607095,0.12000000000000011,null,null,null,null,null,null,null,null,null,null,null,null,null,null,null,"altern. Lebensdauer:","altern. Lebensdauer:","altern. fatigue life:","Durée de vie alternative"]
[null,0.41999999999999993,null,null,null,0.13000000000000012,null,null,null,81.375433886874092,null,null,null,-1727.6402443931249,null,null,null,539.92505972979416,null,null,775.30279890890438,null,null,-692.5830240290768,null,null,0.41999999999999993,null,null,null,0.13000000000000012,null,null,null,81.375433886874092,null,null,null,448.27342059579888,null,null,null,null,1.2466666666666666,null,-1727.6402443931249,539.92505972979416,775.30279890890438,-692.5830240290768,0.13000000000000012,null,null,null,null,null,null,null,null,null,null,null,null,null,null,null,"Anmerkungen","Anmerkungen","remarks","Remarques"]
[null,0.40999999999999992,null,null,null,0.14000000000000012,null,null,null,85.760535424998523,null,null,null,-1843.250811440739,null,null,null,598.74259299932771,null,null,825.57545426534716,null,null,-745.85864126208264,null,null,0.40999999999999992,null,null,null,0.14000000000000012,null,null,null,85.760535424998523,null,null,null,429.02583750861163,null,null,null,null,1.22,null,-1843.250811440739,598.74259299932771,825.57545426534716,-745.85864126208264,0.14000000000000012,null,null,null,null,null,null,null,null,null,null,null,null,null,null,null,"Hilfswerte","Hilfswerte","calculated data","Autres données de calcul"]
[null,0.39999999999999991,null,null,null,0.15000000000000013,null,null,null,89.961529646636819,null,null,null,-1956.3921161501758,null,null,null,660.02938860703898,null,null,874.51010655283233,null,null,-799.13425849508872,null,null,0.39999999999999991,null,null,null,0.15000000000000013,null,null,null,89.961529646636819,null,null,null,411.4519572985709,null,null,null,null,1.1944444444444444,null,-1956.3921161501758,660.02938860703898,874.51010655283233,-799.13425849508872,0.15000000000000013,null,null,null,null,null,null,null,null,null,null,null,null,null,null,null,"Toleranzen nach Mubea-Tellerfedern-Handbuch","Toleranzen nach Mubea-Tellerfedern-Handbuch","tolerances concerning Mubea-disc-spring-handbook","Tolérances selon Manuel Rondelles Ressorts Mubea"]
[null,0.3899999999999999,null,null,null,0.16000000000000014,null,null,null,93.995153580560441,null,null,null,{"$f":"-$AX$5*$AT$5/$AV$3/$AT$1^2*F126*$AT$51*$AY$12*($AX$3*($AY$13/$AT$5-F126*$AT$51*$AY$12/2/$AT$5)+$AX$4)*$AT$56","v":-2067.0641585214348},null,null,null,{"$f":"-$AX$5*$AT$5/$AV$3/$AT$1^2*F126*$AT$51*$AY$12*($AX$3*($AY$13/$AT$5-F126*$AT$51*$AY$12/2/$AT$5)-$AX$4)*$AT$56","v":723.7854465529274},null,null,922.10675577135964,null,null,-852.40987572809456,null,null,0.3899999999999999,null,null,null,0.16000000000000014,null,null,null,93.995153580560441,null,null,null,395.55177996567704,null,null,null,null,1.17,null,-2067.0641585214348,723.7854465529274,922.10675577135964,-852.40987572809456,0.16000000000000014,null,null,null,null,null,null,null,null,null,null,null,null,null,null,null,"Aufstellwinkel bei L0:","Aufstellwinkel bei L0:","disc-angle at L0:","Angle du cone pour Lo:"]
[null,0.37999999999999989,null,null,null,0.17000000000000015,null,null,null,97.878144255540846,null,null,null,-2175.2669385545164,null,null,null,790.01076683699318,null,null,968.36540192092934,null,null,-905.68549296110052,null,null,0.37999999999999989,null,null,null,0.17000000000000015,null,null,null,97.878144255540846,null,null,null,381.32530550992971,null,null,null,null,1.1466666666666665,null,-2175.2669385545164,790.01076683699318,968.36540192092934,-905.68549296110052,0.17000000000000015,null,null,null,null,null,null,null,null,null,null,null,null,null,null,null,"De bei Planlage:","De bei Planlage:","De at flat:","De en position plane"]
[null,0.36999999999999988,null,null,null,0.18000000000000016,null,null,null,101.62723870034952,null,null,null,-2281.0004562494205,null,null,null,858.70534945923657,null,null,1013.2860450015417,null,null,-958.96111019410637,null,null,0.36999999999999988,null,null,null,0.18000000000000016,null,null,null,101.62723870034952,null,null,null,368.77253393132918,null,null,null,null,1.1244444444444444,null,-2281.0004562494205,858.70534945923657,1013.2860450015417,-958.96111019410637,0.18000000000000016,null,null,null,null,null,null,null,null,null,null,null,null,null,null,null,"Di bei Planlage:","Di bei Planlage:","Di at flat:","Di en position plane"]
[null,0.35999999999999988,null,null,null,0.19000000000000017,null,null,null,105.25917394375792,null,null,null,-2384.2647116061476,null,null,null,929.86919441965745,null,null,1056.868685013196,null,null,-1012.2367274271122,null,null,0.35999999999999988,null,null,null,0.19000000000000017,null,null,null,105.25917394375792,null,null,null,357.89346522987563,null,null,null,null,1.1033333333333331,null,-2384.2647116061476,929.86919441965745,1056.868685013196,-1012.2367274271122,0.19000000000000017,null,null,null,null,null,null,null,null,null,null,null,null,null,null,null,"Stülpmittelpunkt:","Stülpmittelpunkt:","center of rotation:","Point de retournement"]
[null,0.34999999999999987,null,null,null,0.20000000000000018,null,null,null,108.79068701453753,null,null,null,-2485.0597046246971,null,null,null,1003.5023017182555,null,null,1099.1133219558926,null,null,-1065.5123446601183,null,null,0.34999999999999987,null,null,null,0.20000000000000018,null,null,null,108.79068701453753,null,null,null,348.68809940556844,null,null,null,null,1.083333333333333,null,-2485.0597046246971,1003.5023017182555,1099.1133219558926,-1065.5123446601183,0.20000000000000018,null,null,null,null,null,null,null,null,null,null,null,null,null,null,null,{"$f":"IF($AQ$2=1,BO130,IF($AQ$2=2,BP130,IF($AQ$2=3,BQ130,\"Wrong language selection\")))","v":"Vorblöckhöhe LV:"},"Vorblöckhöhe LV:","preset height  LV:","Hauteur av. mise en bloc"]
[null,0.33999999999999986,null,null,null,0.21000000000000019,null,null,null,112.23851494145981,null,null,null,-2583.3854353050692,null,null,null,1079.6046713550311,null,null,1140.0199558296317,null,null,-1118.787961893124,null,null,0.33999999999999986,null,null,null,0.21000000000000019,null,null,null,112.23851494145981,null,null,null,341.15643645840811,null,null,null,null,1.0644444444444443,null,-2583.3854353050692,1079.6046713550311,1140.0199558296317,-1118.787961893124,0.21000000000000019,null,null,null,null,null,null,null,null,null,null,null,null,null,null,null,"Aufstellwinkel bei LV:","Aufstellwinkel bei LV:","disc-angle at LV:","Angle du cone à Lv:"]
[null,0.32999999999999985,null,null,null,0.2200000000000002,null,null,null,115.61939475329618,null,null,null,-2679.2419036472634,null,null,null,1158.1763033299837,null,null,1179.5885866344129,null,null,-1172.06357912613,null,null,0.32999999999999985,null,null,null,0.2200000000000002,null,null,null,115.61939475329618,null,null,null,335.2984763883947,null,null,null,null,1.0466666666666664,null,-2679.2419036472634,1158.1763033299837,1179.5885866344129,-1172.06357912613,0.2200000000000002,null,null,null,null,null,null,null,null,null,null,null,null,null,null,null,"Setzverlust bei 20°C:","Setzverlust bei 20°C:","setting at 20°C:","Avachissement à 20°C"]
[null,0.31999999999999984,null,null,null,0.2300000000000002,null,null,null,118.95006347881819,null,null,null,-2772.6291096512814,null,null,null,1239.2171976431141,null,null,1217.8192143702368,null,null,-1225.3391963591359,null,null,0.31999999999999984,null,null,null,0.2300000000000002,null,null,null,118.95006347881819,null,null,null,331.11421919552782,null,null,null,null,1.0299999999999998,null,-2772.6291096512814,1239.2171976431141,1217.8192143702368,-1225.3391963591359,0.2300000000000002,null,null,null,null,null,null,null,null,null,null,null,null,null,null,null,"Setzverlust bei 100°C:","Setzverlust bei 100°C:","setting at 100°C:","Avachissement à 100°C"]
[null,0.30999999999999983,null,null,null,0.24000000000000021,null,null,null,122.24725814679725,null,null,null,-2863.5470533171215,null,null,null,1322.727354294422,null,null,1254.7118390371027,null,null,-1278.6148135921419,null,null,0.30999999999999983,null,null,null,0.24000000000000021,null,null,null,122.24725814679725,null,null,null,328.60366487980775,null,null,null,null,1.0144444444444443,null,-2863.5470533171215,1322.727354294422,1254.7118390371027,-1278.6148135921419,0.24000000000000021,null,null,null,null,null,null,null,null,null,null,null,null,null,null,null," % nach 48h"," % nach 48h"," % after 48h","% après 48h"]
[null,{"$f":"IF(ISBLANK($AQ$16),$H$34,$J$18-$AQ$16/$B$23)","v":0.3},null,null,null,0.25000000000000006,null,null,null,125.52771578600478,null,null,null,-2951.9957346447823,null,null,null,1408.7067732839055,null,null,1290.2664606350104,null,null,-1331.8904308251467,null,null,0.3,null,null,null,0.25000000000000006,null,null,null,125.52771578600478,null,null,null,327.76681344123466,null,null,null,null,1,null,-2951.9957346447823,1408.7067732839055,1290.2664606350104,-1331.8904308251467,0.25000000000000006,null,null,null,null,null,null,null,null,null,null,null,null,null,null,null," % nach 1000h"," % nach 1000h"," % after 1000h","% après 1000h"]
[null,{"$f":"$B$22","v":" "},null,null,null,null,null,null,null,{"$f":"$J$22","v":" "},null,null,null,{"$f":"$N$22","v":" "},null,null,null,{"$f":"$B$23","v":1},null,null,null,{"$f":"$F$23","v":"Feder"},null,null,null,{"$f":"$J$23","v":1},null,null,null,{"$f":"$N$23","v":" "},null,null,null,null,null,null,null,null,null,null,null,null,null,null,null,null,null,null,null,null,null,null,null,null,null,null,null,null,null,null,null,null,null,null,null,"Druckspannung:","Druckspannung:","compressive stress:","Contrainte de pression"]
[null,{"$f":"$B$13","v":"Tellerfederabmessung"},null,null,null,null,null,null,null,null,null,null,null,null,null,null,null,null,null,null,null,null,null,null,null,null,null,null,{"$f":"$AE$24","v":"Lastpunkte"},null,null,null,null,null,null,null,null,null,null,null,null,null,null,null,null,null,null,null,null,null,null,null,null,null,null,null,null,null,null,null,null,null,null,null,null,"Temperatur:","Temperatur:","temperature:","Température"]
[null,{"$f":"$B$14","v":"Außendurchm.:"},null,null,null,null,null,"De=",null,null,{"$f":"$J$14","v":8},null,null,null,null,null,null,{"$f":"$AT$53","v":" mm"},null,null,null,null,null,null,null,null,null,null,{"$f":"$AE$25","v":"der Einzelfeder"},null,null,null,null,null,null,null,null,null,null,null,null,null,null,null,null,null,null,null,null,null,null,null,null,null,null,null,null,null,null,null,null,null,null,null,null,"Anwendungstemperatur unterhalb der min-Temperatur für diesen Werkstoff","Anwendungstemperatur unterhalb der min-Temperatur für diesen Werkstoff","usage-temperature below min-temperature of this material","Temp. d'utilisation au-dessous de la temp. mini pour cette matière"]
[null,{"$f":"$B$15","v":"Innendurchm.:"},null,null,null,null,null,"Di=",null,null,{"$f":"$J$15","v":3.2},null,null,null,null,null,null,{"$f":"$AT$53","v":" mm"},null,null,null,null,null,null,null,null,null,null,{"$f":"$B$26","v":"Last-"},null,null,{"$f":"$AE$26","v":"Länge l"},null,null,null,null,{"$f":"$AI$26","v":"Weg s"},null,null,{"$f":"$AM$26","v":"Kraft F"},null,null,null,"Hilfe für Spiel",null,null,"Hilfe für Setzverlust",null,null,null,null,null,null,null,null,null,null,null,null,null,null,null,null,null,null,"Anwendungstemperatur oberhalb der max-Temperatur für diesen Werkstoff","Anwendungstemperatur oberhalb der max-Temperatur für diesen Werkstoff","usage-temperature above max-temperature of this material","Temp. d'utilisation au-dessus de la temp. maxi pour cette matière"]
[null,{"$f":"$B$16","v":"Blechdicke:"},null,null,null,null,null,"t=",null,null,{"$f":"$J$16","v":0.3},null,null,null,null,null,null,{"$f":"$AT$53","v":" mm"},null,null,null,null,null,null,null,null,null,null,{"$f":"$B$27","v":"punkt"},null,null,{"$f":"$AT$53","v":" mm"},null,null,null,null,{"$f":"$AT$53","v":" mm"},null,null,{"$f":"$AT$54","v":" N"},null,null,null,{"$f":"IF($AT$2<16,0.2,IF($AT$2<20,0.3,IF($AT$2<26,0.4,IF($AT$2<31.5,0.5,IF($AT$2<50,0.6,IF($AT$2<80,0.8,IF($AT$2<140,1,IF($AT$2<250,1.6,2))))))))","v":0.2},null,null,{"$f":"$S$34/$AT$56","v":-2951.9957346447823},null,null,null,null,null,null,null,null,null,null,null,null,null,null,null,null,null,null,"Blechdicke zu groß für diesen Werkstoff","Blechdicke zu groß für diesen Werkstoff","material thickness too big for this material","Epaisseur trop grande pour cette matière"]
[null,{"$f":"$B$17","v":"red. Blechdicke:"},null,null,null,null,null,"t'=",null,null,{"$f":"$J$17","v":0.3},null,null,null,null,null,null,{"$f":"$AT$53","v":" mm"},null,null,null,null,null,null,null,null,null,null,{"$f":"$B$28","v":0},null,null,null,{"$f":"$AE$28","v":0.55000000000000004},null,null,{"$f":"$AL$28","v":0},null,null,null,{"$f":"$AP$28","v":0},null,null,null,{"$f":"IF($AT$1<16,0.2,IF($AT$1<20,0.3,IF($AT$1<26,0.4,IF($AT$1<31.5,0.5,IF($AT$1<50,0.6,IF($AT$1<80,0.8,IF($AT$1<140,1,IF($AT$1<250,1.6,2))))))))","v":0.2},null,null,null,null,null,null,null,null,null,null,null,null,null,null,null,null,null,null,null,null,null,"Werkstoffwahl","Werkstoffwahl","choose mat.","Choix matière"]
[null,{"$f":"$B$18","v":"Federhöhe:"},null,null,null,null,null,"l0=",null,null,{"$f":"$J$18","v":0.55000000000000004},null,null,null,null,null,null,{"$f":"$AT$53","v":" mm"},null,null,null,null,null,null,null,null,null,null,{"$f":"IF($AQ$41=0,B$28,IF($AQ$41=1,B$29,IF($AQ$41=2,B$30,IF($AQ$41=3,B$31,IF($AQ$41=4,#REF!,IF($AQ$41=5,#REF!,IF(OR($AQ$41=\"c\",$AQ$41=\"C\"),B$34)))))))","v":1},null,null,null,{"$f":"IF($AQ$41=0,AE$28,IF($AQ$41=1,AE$29,IF($AQ$41=2,AE$30,IF($AQ$41=3,AE$31,IF($AQ$41=4,AE$32,IF($AQ$41=5,AE$33,IF(OR($AQ$41=\"c\",$AQ$41=\"C\"),AE$34)))))))","v":0.48800000000000004},null,null,{"$f":"IF($AQ$41=0,AL$28,IF($AQ$41=1,AI$29,IF($AQ$41=2,AI$30,IF($AQ$41=3,AI$31,IF($AQ$41=4,AI$32,IF($AQ$41=5,AI$33,IF(OR($AQ$41=\"c\",$AQ$41=\"C\"),AI$34)))))))","v":6.2E-2},null,null,null,{"$f":"IF($AQ$41=0,AP$28,IF($AQ$41=1,AM$29,IF($AQ$41=2,AM$30,IF($AQ$41=3,AM$31,IF($AQ$41=4,AM$32,IF($AQ$41=5,AM$33,IF(OR($AQ$41=\"c\",$AQ$41=\"C\"),AM$34)))))))","v":45.37221045222546},null,null,null,{"$f":"IF($AT$5<0.6,$AT$5-0.06,IF($AT$5<1.25,$AT$5-0.09,IF($AT$5<3.8,$AT$5-0.12,IF($AT$5<6,$AT$5-0.15,IF($AT$5<15,$AT$5-0.1,IF($AT$5<25,$AT$5-0.12,IF($AT$5<40,$AT$5-0.15)))))))","v":0.24},{"$f":"IF($AT$5<0.6,$AT$5+0.02,IF($AT$5<1.25,$AT$5+0.03,IF($AT$5<3.8,$AT$5+0.04,IF($AT$5<6,$AT$5+0.05,IF($AT$5<15,$AT$5+0.1,IF($AT$5<25,$AT$5+0.12,IF($AT$5<40,$AT$5+0.15)))))))","v":0.32},null,null,null,null,null,null,null,null,null,null,null,null,null,null,null,null,null,null,null,null,"für diesen Werkstoff:","für diesen Werkstoff:","for this material:","pour cette matière"]
[null,{"$f":"$B$36","v":"Werkstoff:"},null,null,null,null,null,{"$f":"$N$36","v":"1.8159 (51 CrV 4)"},null,null,null,null,null,null,null,null,null,null,null,null,null,null,null,null,null,null,null,null,{"$f":"IF($AQ$42=0,B$28,IF($AQ$42=1,B$29,IF($AQ$42=2,B$30,IF($AQ$42=3,B$31,IF($AQ$42=4,#REF!,IF($AQ$42=5,#REF!,IF(OR($AQ$42=\"c\",$AQ$42=\"C\"),B$34)))))))","v":2},null,null,null,{"$f":"IF($AQ$42=0,AE$28,IF($AQ$42=1,AE$29,IF($AQ$42=2,AE$30,IF($AQ$42=3,AE$31,IF($AQ$42=4,AE$32,IF($AQ$42=5,AE$33,IF(OR($AQ$42=\"c\",$AQ$42=\"C\"),AE$34)))))))","v":0.36300000000000004},null,null,{"$f":"IF($AQ$42=0,AL$28,IF($AQ$42=1,AI$29,IF($AQ$42=2,AI$30,IF($AQ$42=3,AI$31,IF($AQ$42=4,AI$32,IF($AQ$42=5,AI$33,IF(OR($AQ$42=\"c\",$AQ$42=\"C\"),AI$34)))))))","v":0.187},null,null,null,{"$f":"IF($AQ$42=0,AP$28,IF($AQ$42=1,AM$29,IF($AQ$42=2,AM$30,IF($AQ$42=3,AM$31,IF($AQ$42=4,AM$32,IF($AQ$42=5,AM$33,IF(OR($AQ$42=\"c\",$AQ$42=\"C\"),AM$34)))))))","v":104.18089923367049},null,null,null,{"$f":"IF($AT$5<1.25,$AT$6-0.05,IF($AT$5<2,$AT$6-0.08,IF($AT$5<3,$AT$6-0.1,IF($AT$5<6,$AT$6-0.15,IF($AT$5<15,$AT$6-0.3,IF($AT$5<25,$AT$6-0.5,IF($AT$5<40,$AT$6-1)))))))","v":0.5},{"$f":"IF($AT$5<1.25,$AT$6+0.1,IF($AT$5<2,$AT$6+0.15,IF($AT$5<3,$AT$6+0.2,IF($AT$5<6,$AT$6+0.3,IF($AT$5<15,$AT$6+0.3,IF($AT$5<25,$AT$6+0.5,IF($AT$5<40,$AT$6+1)))))))","v":0.65},null,null,null,null,null,null,null,null,null,null,null,null,null,null,null,null,null,null,null,null,"Keine direkte Lebensdauerberechnung.","Keine direkte Lebensdauerberechnung.","No direct calculation of fatigue life.","Pas de calculation directe de la durée de vie."]
[null,{"$f":"$X$36","v":"E-Modul:"},null,null,null,null,null,{"$f":"$AE$36","v":206000},null,null,null,null,{"$f":"$AT$59","v":"MPa"},null,null,null,{"$f":"$BN$51","v":"bei"},null,null,null,{"$f":"$AE$37","v":20},null,null,null,{"$f":"$AL$37","v":"°C"},null,null,null,null,{"$f":"$B$34","v":"Plan"},null,null,{"$f":"$AE$34","v":0.3},null,null,{"$f":"$AI$34","v":0.25000000000000006},null,null,null,{"$f":"$AM$34","v":125.52771578600478},null,null,null,"Hilfe für Dicke",null,null,null,null,null,null,null,null,null,null,null,null,null,null,null,null,null,null,null,null,null,"Temperatur zu niedrig","Temperatur zu niedrig","Temperature too low","Température trop petit"]
[null,null,null,null,null,null,null,null,null,null,null,null,null,null,null,null,null,null,null,null,null,null,null,null,null,null,null,null,null,null,null,null,null,null,null,null,null,null,null,null,null,null,null,null,null,null,null,null,null,null,null,null,null,null,null,null,null,null,null,null,null,null,null,null,null,"Temperatur zu hoch","Temperatur zu hoch","Temperature too high","Température trop grand"]
[null,null,null,null,null,null,null,null,null,null,null,null,null,null,null,null,null,null,null,null,null,null,null,null,null,null,null,null,null,null,null,null,null,null,null,null,null,null,null,null,null,null,null,null,null,null,null,null,null,null,null,null,null,null,null,null,null,null,null,null,null,null,null,null,null,0,null,null,{"$f":"\"Force min au pt  \"&$AQ$41&\" :\"","v":"Force min au pt  1 :"}]
[null,null,null,null,null,null,null,null,null,null,null,null,null,null,null,null,null,null,null,null,null,null,null,null,null,null,null,null,null,null,null,null,null,null,null,null,null,null,null,null,null,null,null,null,null,null,null,null,null,null,null,null,null,null,null,null,null,null,null,null,null,null,null,null,null,0,null,null,{"$f":"\"Force max au pt  \"&$AQ$41&\" :\"","v":"Force max au pt  1 :"}]
[null,null,null,null,null,null,null,null,null,null,null,null,null,null,null,null,null,null,null,null,null,null,null,null,null,null,null,null,null,null,null,null,null,null,null,null,null,null,null,null,null,null,null,null,null,null,null,null,null,null,null,null,null,null,null,null,null,null,null,null,null,null,null,null,null,0,null,null,{"$f":"\"Force min au pt \"&$AQ$42&\" :\"","v":"Force min au pt 2 :"}]
[null,null,null,null,null,null,null,null,null,null,null,null,null,null,null,null,null,null,null,null,null,null,null,null,null,null,null,null,null,null,null,null,null,null,null,null,null,null,null,null,null,null,null,null,null,null,null,null,null,null,null,null,null,null,null,null,null,null,null,null,null,null,null,null,null,0,null,null,{"$f":"\"Force max au pt \"&$AQ$42&\" :\"","v":"Force max au pt 2 :"}]
[null,null,null,null,null,null,null,null,null,null,null,null,null,null,null,null,null,null,null,null,null,null,null,null,null,null,null,null,null,null,null,null,null,null,null,null,null,null,null,null,null,null,null,null,null,null,null,null,null,null,null,null,null,null,null,null,null,null,null,null,null,null,null,null,null,"Einheiten","Einheiten","Dimensions","Dimensions"]
[null,null,null,null,null,null,null,null,null,null,null,null,null,null,null,null,null,null,null,null,null,null,null,null,null,null,null,null,null,null,null,null,null,null,null,null,null,null,null,null,null,null,null,null,null,null,null,null,null,null,null,null,null,null,null,null,null,null,null,null,null,null,null,null,null,"Fehler! Zelle ","Fehler! Zelle ","Error! Cell ","Erreur! Cellule"]
[null,null,null,null,null,null,null,null,null,null,null,null,null,null,null,null,null,null,null,null,null,null,null,null,null,null,null,null,null,null,null,null,null,null,null,null,null,null,null,null,null,null,null,null,null,null,null,null,null,null,null,null,null,null,null,null,null,null,null,null,null,null,null,null,null," nicht im vorgesehenen Bereich A30-L34"," nicht im vorgesehenen Bereich A30-L34"," not in designated Cell Area A30-L34","pas dans la zone désignée A30-L34"]
[null,null,null,null,null,null,null,null,null,null,null,null,null,null,null,null,null,null,null,null,null,null,null,null,null,null,null,null,null,null,null,null,null,null,null,null,null,null,null,null,null,null,null,null,null,null,null,null,null,null,null,null,null,null,null,null,null,null,null,null,null,null,null,null,null,"die Einfederung in Prozent","die Einfederung in Prozent","Deflection in Percent","Déflexion en pourcentage"]
[null,null,null,null,null,null,null,null,null,null,null,null,null,null,null,null,null,null,null,null,null,null,null,null,null,null,null,null,null,null,null,null,null,null,null,null,null,null,null,null,null,null,null,null,null,null,null,null,null,null,null,null,null,null,null,null,null,null,null,null,null,null,null,null,null,"Fehler! Spalte B (Lastpunkt) darf für die Berechnung nicht angewählt werden.","Fehler! Spalte B (Lastpunkt) darf für die Berechnung nicht angewählt werden.","Error! Column B (Loadpoint No.) and C (Springheight) are not allowed for calculation.","Erreur! La colonne B (point de charge) et C (hauteur du ressort) ne doivent pas être sélectionnées pour le calcul"]
[null,null,null,null,null,null,null,null,null,null,null,null,null,null,null,null,null,null,null,null,null,null,null,null,null,null,null,null,null,null,null,null,null,null,null,null,null,null,null,null,null,null,null,null,null,null,null,null,null,null,null,null,null,null,null,null,null,null,null,null,null,null,null,null,null,"die Federhöhe in mm",{"$f":"\"die Federhöhe in\"&$AT$53","v":"die Federhöhe in mm"},{"$f":"\"Springheight in\"&$AT$53","v":"Springheight in mm"},"Hauteur du ressort en"]
[null,null,null,null,null,null,null,null,null,null,null,null,null,null,null,null,null,null,null,null,null,null,null,null,null,null,null,null,null,null,null,null,null,null,null,null,null,null,null,null,null,null,null,null,null,null,null,null,null,null,null,null,null,null,null,null,null,null,null,null,null,null,null,null,null,"den Federweg in mm",{"$f":"\"den Federweg in\"&$AT$53","v":"den Federweg in mm"},{"$f":"\"Springtravel in\"&$AT$53","v":"Springtravel in mm"},"Course du ressort en"]
[null,null,null,null,null,null,null,null,null,null,null,null,null,null,null,null,null,null,null,null,null,null,null,null,null,null,null,null,null,null,null,null,null,null,null,null,null,null,null,null,null,null,null,null,null,null,null,null,null,null,null,null,null,null,null,null,null,null,null,null,null,null,null,null,null,"die Federkraft in N",{"$f":"\"die Federkraft in\"&$AT$54","v":"die Federkraft in N"},{"$f":"\"Springforce in\"&$AT$54","v":"Springforce in N"},"Effort du ressort en"]
[null,null,null,null,null,null,null,null,null,null,null,null,null,null,null,null,null,null,null,null,null,null,null,null,null,null,null,null,null,null,null,null,null,null,null,null,null,null,null,null,null,null,null,null,null,null,null,null,null,null,null,null,null,null,null,null,null,null,null,null,null,null,null,null,null,"die Spannung an Kante I in MPa",{"$f":"\"die Spannung an Kante I in \"&$AT$55","v":"die Spannung an Kante I in MPa"},{"$f":"\"Stress at Edge I in \"&$AT$55","v":"Stress at Edge I in MPa"},"Contrainte à l'angle I en"]
[null,null,null,null,null,null,null,null,null,null,null,null,null,null,null,null,null,null,null,null,null,null,null,null,null,null,null,null,null,null,null,null,null,null,null,null,null,null,null,null,null,null,null,null,null,null,null,null,null,null,null,null,null,null,null,null,null,null,null,null,null,null,null,null,null,"die Spannung an Kante II in MPa",{"$f":"\"die Spannung an Kante II in \"&$AT$55","v":"die Spannung an Kante II in MPa"},{"$f":"\"Stress at Edge II in \"&$AT$55","v":"Stress at Edge II in MPa"},"Contrainte à l'angle II en"]
[null,null,null,null,null,null,null,null,null,null,null,null,null,null,null,null,null,null,null,null,null,null,null,null,null,null,null,null,null,null,null,null,null,null,null,null,null,null,null,null,null,null,null,null,null,null,null,null,null,null,null,null,null,null,null,null,null,null,null,null,null,null,null,null,null,"die Spannung an Kante III in MPa",{"$f":"\"die Spannung an Kante III in \"&$AT$55","v":"die Spannung an Kante III in MPa"},{"$f":"\"Stress at Edge III in \"&$AT$55","v":"Stress at Edge III in MPa"},"Contrainte à l'angle III en"]
[null,null,null,null,null,null,null,null,null,null,null,null,null,null,null,null,null,null,null,null,null,null,null,null,null,null,null,null,null,null,null,null,null,null,null,null,null,null,null,null,null,null,null,null,null,null,null,null,null,null,null,null,null,null,null,null,null,null,null,null,null,null,null,null,null,"die Sigma OM Spannung in MPa",{"$f":"\"die Sigma OM Spannung in \"&$AT$55","v":"die Sigma OM Spannung in MPa"},{"$f":"\"Sigma OM Stress in \"&$AT$55","v":"Sigma OM Stress in MPa"},"Contrainte sigma OM en"]
[null,null,null,null,null,null,null,null,null,null,null,null,null,null,null,null,null,null,null,null,null,null,null,null,null,null,null,null,null,null,null,null,null,null,null,null,null,null,null,null,null,null,null,null,null,null,null,null,null,null,null,null,null,null,null,null,null,null,null,null,null,null,null,null,null,{"$f":"IF($AQ$2=1,BO162,IF($AQ$2=2,BP162,IF($AQ$2=3,BQ162,\"Wrong language selection\")))","v":"die Länge der Federsäule in mm"},{"$f":"\"die Länge der Federsäule in\"&$AT$53","v":"die Länge der Federsäule in mm"},{"$f":"\"Height of Springstack in\"&$AT$53","v":"Height of Springstack in mm"},"Hauteur de l'empilage en"]
[null,null,null,null,null,null,null,null,null,null,null,null,null,null,null,null,null,null,null,null,null,null,null,null,null,null,null,null,null,null,null,null,null,null,null,null,null,null,null,null,null,null,null,null,null,null,null,null,null,null,null,null,null,null,null,null,null,null,null,null,null,null,null,null,null,"den Federweg der Federsäule in mm",{"$f":"\"den Federweg der Federsäule in\"&$AT$53","v":"den Federweg der Federsäule in mm"},{"$f":"\"Travel of Springstack in\"&$AT$53","v":"Travel of Springstack in mm"},"Course de l'empilage en"]
[null,null,null,null,null,null,null,null,null,null,null,null,null,null,null,null,null,null,null,null,null,null,null,null,null,null,null,null,null,null,null,null,null,null,null,null,null,null,null,null,null,null,null,null,null,null,null,null,null,null,null,null,null,null,null,null,null,null,null,null,null,null,null,null,null,"die Federkraft der Federsäule in mm",{"$f":"\"die Federkraft der Federsäule in\"&$AT$53","v":"die Federkraft der Federsäule in mm"},{"$f":"\"Springforce of Springstack in \"&$AT$54","v":"Springforce of Springstack in  N"},"Force de l'empilage en"]
[null,null,null,null,null,null,null,null,null,null,null,null,null,null,null,null,null,null,null,null,null,null,null,null,null,null,null,null,null,null,null,null,null,null,null,null,null,null,null,null,null,null,null,null,null,null,null,null,null,null,null,null,null,null,null,null,null,null,null,null,null,null,null,null,null,"Ups, das hätte nicht passieren sollen, bitte wenden Sie sich an Mubea.","Ups, das hätte nicht passieren sollen, bitte wenden Sie sich an Mubea.","Error, which shout not happen, please contact Mubea.","Erreur, qui n'aurait pas dû se produire, veuillez contacter Mubea."]
[null,null,null,null,null,null,null,null,null,null,null,null,null,null,null,null,null,null,null,null,null,null,null,null,null,null,null,null,null,null,null,null,null,null,null,null,null,null,null,null,null,null,null,null,null,null,null,null,null,null,null,null,null,null,null,null,null,null,null,null,null,null,null,null,null,"Bitte Zielwert für ","Bitte Zielwert für ","Please insert Target Value for ","Merci d'intègrer une valeur cible pour"]
[null,null,null,null,null,null,null,null,null,null,null,null,null,null,null,null,null,null,null,null,null,null,null,null,null,null,null,null,null,null,null,null,null,null,null,null,null,null,null,null,null,null,null,null,null,null,null,null,null,null,null,null,null,null,null,null,null,null,null,null,null,null,null,null,null," von Lastpunkt "," von Lastpunkt "," of Loadpoint","Du point de charge"]
[null,null,null,null,null,null,null,null,null,null,null,null,null,null,null,null,null,null,null,null,null,null,null,null,null,null,null,null,null,null,null,null,null,null,null,null,null,null,null,null,null,null,null,null,null,null,null,null,null,null,null,null,null,null,null,null,null,null,null,null,null,null,null,null,null," angeben"," angeben",{"$f":"\"\"","v":""},"Spécifier"]
[null,null,null,null,null,null,null,null,null,null,null,null,null,null,null,null,null,null,null,null,null,null,null,null,null,null,null,null,null,null,null,null,null,null,null,null,null,null,null,null,null,null,null,null,null,null,null,null,null,null,null,null,null,null,null,null,null,null,null,null,null,null,null,null,null,"Zielvorgabe für die Berechnung","Zielvorgabe für die Berechnung","Targetvalue for Calculation","Valeur cible pour le calcul"]
[null,null,null,null,null,null,null,null,null,null,null,null,null,null,null,null,null,null,null,null,null,null,null,null,null,null,null,null,null,null,null,null,null,null,null,null,null,null,null,null,null,null,null,null,null,null,null,null,null,null,null,null,null,null,null,null,null,null,null,null,null,null,null,null,null,"Zielwert-","Zielwert-","Target-","Valeur cible"]
[null,null,null,null,null,null,null,null,null,null,null,null,null,null,null,null,null,null,null,null,null,null,null,null,null,null,null,null,null,null,null,null,null,null,null,null,null,null,null,null,null,null,null,null,null,null,null,null,null,null,null,null,null,null,null,null,null,null,null,null,null,null,null,null,null,"vorgabe","vorgabe","value","Données"]
[null,null,null,null,null,null,null,null,null,null,null,null,null,null,null,null,null,null,null,null,null,null,null,null,null,null,null,null,null,null,null,null,null,null,null,null,null,null,null,null,null,null,null,null,null,null,null,null,null,null,null,null,null,null,null,null,null,null,null,null,null,null,null,null,null,"Fehler! Ungültige Zeile ausgewählt.","Fehler! Ungültige Zeile ausgewählt.","Error! Invalid row selected.","Erreur! Ligne non valide sélectionnée."]
[null,null,null,null,null,null,null,null,null,null,null,null,null,null,null,null,null,null,null,null,null,null,null,null,null,null,null,null,null,null,null,null,null,null,null,null,null,null,null,null,null,null,null,null,null,null,null,null,null,null,null,null,null,null,null,null,null,null,null,null,null,null,null,null,null,"ist abzustimmen","ist abzustimmen","to be defined","à définir"]
[null,null,null,null,null,null,null,null,null,null,null,null,null,null,null,null,null,null,null,null,null,null,null,null,null,null,null,null,null,null,null,null,null,null,null,null,null,null,null,null,null,null,null,null,null,null,null,null,null,null,null,null,null,null,null,null,null,null,null,null,null,null,null,null,null,"Revision","Revision","Revision","Révision"]
[null,null,null,null,null,null,null,null,null,null,null,null,null,null,null,null,null,null,null,null,null,null,null,null,null,null,null,null,null,null,null,null,null,null,null,null,null,null,null,null,null,null,null,null,null,null,null,null,null,null,null,null,null,null,null,null,null,null,null,null,null,null,null,null,null,"Kunde","Kunde","Customer","Client"]
[null,null,null,null,null,null,null,null,null,null,null,null,null,null,null,null,null,null,null,null,null,null,null,null,null,null,null,null,null,null,null,null,null,null,null,null,null,null,null,null,null,null,null,null,null,null,null,null,null,null,null,null,null,null,null,null,null,null,null,null,null,null,null,null,null,"h0/t Verhältnis zu groß, Feder nicht in wechselsinnig geschichteter Säule einsetzbar","h0/t Verhältnis zu groß, Feder nicht in wechselsinnig geschichteter Säule einsetzbar","h0/t ratio too large, spring cannot be used in alternately layered stack","Ratio ho/t trop élevé, montage des ressorts dans un empilage en opposition non réalisable"]
[null,null,null,null,null,null,null,null,null,null,null,null,null,null,null,null,null,null,null,null,null,null,null,null,null,null,null,null,null,null,null,null,null,null,null,null,null,null,null,null,null,null,null,null,null,null,null,null,null,null,null,null,null,null,null,null,null,null,null,null,null,null,null,null,null,"Lebensdauer ist durch einen Schwingversuch zu bestätigen","Lebensdauer ist durch einen Schwingversuch zu bestätigen","Lifetime to be confirmed by vibration test","La durée de vie doit être confirmée par un essai de cyclage"]
[null,null,null,null,null,null,null,null,null,null,null,null,null,null,null,null,null,null,null,null,null,null,null,null,null,null,null,null,null,null,null,null,null,null,null,null,null,null,null,null,null,null,null,null,null,null,null,null,null,null,null,null,null,null,null,null,null,null,null,null,null,null,null,null,null,"Federgeometrie außerhalb der Normvorgaben","Federgeometrie außerhalb der Normvorgaben","Spring geometry outside the standard specifications","Géométrie du ressort en dehors des spécifications de la norme."]
[null,null,null,null,null,null,null,null,null,null,null,null,null,null,null,null,null,null,null,null,null,null,null,null,null,null,null,null,null,null,null,null,null,null,null,null,null,null,null,null,null,null,null,null,null,null,null,null,null,null,null,null,null,null,null,null,null,null,null,null,null,null,null,null,null,"Tellerfeder nicht setzfest","Tellerfeder nicht setzfest","Springs will have set loss","Ressort non mis en bloc"]
[null,null,null,null,null,null,null,null,null,null,null,null,null,null,null,null,null,null,null,null,null,null,null,null,null,null,null,null,null,null,null,null,null,null,null,null,null,null,null,null,null,null,null,null,null,null,null,null,null,null,null,null,null,null,null,null,null,null,null,null,null,null,null,null,null,"Oberspannung zu groß","Oberspannung zu groß","upper stress too high","Contrainte sup. trop grande"]
[null,null,null,null,null,null,null,null,null,null,null,null,null,null,null,null,null,null,null,null,null,null,null,null,null,null,null,null,null,null,null,null,null,null,null,null,null,null,null,null,null,null,null,null,null,null,null,null,null,null,null,null,null,null,null,null,null,null,null,null,null,null,null,null,null,0]
[null,null,null,null,null,null,null,null,null,null,null,null,null,null,null,null,null,null,null,null,null,null,null,null,null,null,null,null,null,null,null,null,null,null,null,null,null,null,null,null,null,null,null,null,null,null,null,null,null,null,null,null,null,null,null,null,null,null,null,null,null,null,null,null,null,0]
[null,null,null,null,null,null,null,null,null,null,null,null,null,null,null,null,null,null,null,null,null,null,null,null,null,null,null,null,null,null,null,null,null,null,null,null,null,null,null,null,null,null,null,null,null,null,null,null,null,null,null,null,null,null,null,null,null,null,null,null,null,null,null,null,null,0]
[null,null,null,null,null,null,null,null,null,null,null,null,null,null,null,null,null,null,null,null,null,null,null,null,null,null,null,null,null,null,null,null,null,null,null,null,null,null,null,null,null,null,null,null,null,null,null,null,null,null,null,null,null,null,null,null,null,null,null,null,null,null,null,null,null,0]
[null,null,null,null,null,null,null,null,null,null,null,null,null,null,null,null,null,null,null,null,null,null,null,null,null,null,null,null,null,null,null,null,null,null,null,null,null,null,null,null,null,null,null,null,null,null,null,null,null,null,null,null,null,null,null,null,null,null,null,null,null,null,null,null,null,0]
[null,null,null,null,null,null,null,null,null,null,null,null,null,null,null,null,null,null,null,null,null,null,null,null,null,null,null,null,null,null,null,null,null,null,null,null,null,null,null,null,null,null,null,null,null,null,null,null,null,null,null,null,null,null,null,null,null,null,null,null,null,null,null,null,null,0]
[null,null,null,null,null,null,null,null,null,null,null,null,null,null,null,null,null,null,null,null,null,null,null,null,null,null,null,null,null,null,null,null,null,null,null,null,null,null,null,null,null,null,null,null,null,null,null,null,null,null,null,null,null,null,null,null,null,null,null,null,null,null,null,null,null,0]
[null,null,null,null,null,null,null,null,null,null,null,null,null,null,null,null,null,null,null,null,null,null,null,null,null,null,null,null,null,null,null,null,null,null,null,null,null,null,null,null,null,null,null,null,null,null,null,null,null,null,null,null,null,null,null,null,null,null,null,null,null,null,null,null,null,0]
[null,null,null,null,null,null,null,null,null,null,null,null,null,null,null,null,null,null,null,null,null,null,null,null,null,null,null,null,null,null,null,null,null,null,null,null,null,null,null,null,null,null,null,null,null,null,null,null,null,null,null,null,null,null,null,null,null,null,null,null,null,null,null,null,null,0]
[null,null,null,null,null,null,null,null,null,null,null,null,null,null,null,null,null,null,null,null,null,null,null,null,null,null,null,null,null,null,null,null,null,null,null,null,null,null,null,null,null,null,null,null,null,null,null,null,null,null,null,null,null,null,null,null,null,null,null,null,null,null,null,null,null,0]
[null,null,null,null,null,null,null,null,null,null,null,null,null,null,null,null,null,null,null,null,null,null,null,null,null,null,null,null,null,null,null,null,null,null,null,null,null,null,null,null,null,null,null,null,null,null,null,null,null,null,null,null,null,null,null,null,null,null,null,null,null,null,null,null,null,0]
[null,null,null,null,null,null,null,null,null,null,null,null,null,null,null,null,null,null,null,null,null,null,null,null,null,null,null,null,null,null,null,null,null,null,null,null,null,null,null,null,null,null,null,null,null,null,null,null,null,null,null,null,null,null,null,null,null,null,null,null,null,null,null,null,null,0]
[null,null,null,null,null,null,null,null,null,null,null,null,null,null,null,null,null,null,null,null,null,null,null,null,null,null,null,null,null,null,null,null,null,null,null,null,null,null,null,null,null,null,null,null,null,null,null,null,null,null,null,null,null,null,null,null,null,null,null,null,null,null,null,null,null,"DIN-Toleranzen","DIN-Toleranzen","DIN-Tolerances","Tolérances DIN"]
[null,null,null,null,null,null,null,null,null,null,null,null,null,null,null,null,null,null,null,null,null,null,null,null,null,null,null,null,null,null,null,null,null,null,null,null,null,null,null,null,null,null,null,null,null,null,null,null,null,null,null,null,null,null,null,null,null,null,null,null,null,null,null,null,null,"Sondermaterial","Sondermaterial","special material","Matière spéciale"]
[null,null,null,null,null,null,null,null,null,null,null,null,null,null,null,null,null,null,null,null,null,null,null,null,null,null,null,null,null,null,null,null,null,null,null,null,null,null,null,null,null,null,null,null,null,null,null,null,null,null,null,null,null,null,null,null,null,null,null,null,null,null,null,null,null,"Prüfung aller Federmerkmale bei 20°C","Prüfung aller Federmerkmale bei 20°C","Testing of all spring characteristics at 20°C","Contrôle de toutes les caractéristiques du ressort à 20°C"]
[null,null,null,null,null,null,null,null,null,null,null,null,null,null,null,null,null,null,null,null,null,null,null,null,null,null,null,null,null,null,null,null,null,null,null,null,null,null,null,null,null,null,null,null,null,null,null,null,null,null,null,null,null,null,null,null,null,null,null,null,null,null,null,null,null,"Bitte einen gültigen Lastpunkt eingeben.","Bitte einen gültigen Lastpunkt eingeben.","Please enter a valid loadpoint.","Entrez un point de charge valide, SVP."]

{"sheet":"Standard","index":1,"n_rows":248,"n_cols":29,"rows_kept":248,"cut":false,"hidden":false,"merged":[[0,8,0,12],[0,23,0,27],[0,18,0,22],[0,13,0,17],[0,3,0,6]]}
[{"$f":"Programm!BN88","v":"Bestell-"},{"$f":"Programm!BN85","v":"kopieren"},null,{"$f":"Programm!BN86","v":"Standardabmessungen"},null,null,null,null,"s = 0,25 h0",null,null,null,null,"s = 0,50 h0",null,null,null,null,"s = 0,75 h0",null,null,null,null,"s = 1,00 h0",null,null,null,null,{"$f":"Programm!BN90","v":"Masse 1000 Stück"}]
[{"$f":"Programm!BN89","v":"Nr.:"},"De","Di","t","t'","l0","h0","h0/t","s","F","s1","s2","s3","s","F","s1","s2","s3","s","F","s1","s2","s3","s","F","s1","s2","s3","in kg"]
["17 0001",8,3.2,0.3,null,0.55000000000000004,0.25,0.83299999999999996,6.2E-2,45.6,"883","207","401",0.125,79.099999999999994,"1669","511","750",0.187,104.3,"2359","912","1046",0.25,125.5,"2952","1409","1290",9.9000000000000005E-2]
["17 0002",8,3.2,0.4,null,0.6,0.2,0.5,0.05,69.2,"797","365","350",0.1,130.1,"1533","792","666",0.15,185.5,"2207","1281","949",0.2,238,"2820","1832","1198",0.13300000000000001]
["17 0003",8,3.2,0.5,null,0.7,0.2,0.4,0.05,128.4,"943","511","408",0.1,246.4,"1824","1083","782",0.15,357.4,"2643","1717","1123",0.2,464.9,"3401","2413","1430",0.16600000000000001]
["17 0004",8,4.2,0.2,null,0.45,0.25,1.25,6.2E-2,21.2,"696","8","409",0.125,33.299999999999997,"1294","114","753",0.187,39.200000000000003,"1794","319","1034",0.25,42,"2195","622","1251",5.7000000000000002E-2]
["17 0005",8,4.2,0.3,null,0.55000000000000004,0.25,0.83299999999999996,6.2E-2,51.6,"872","184","501",0.125,89.3,"1646","467","938",0.187,117.9,"2322","847","1312",0.25,141.80000000000001,"2900","1326","1620",8.5999999999999993E-2]
["17 0006",8,4.2,0.4,null,0.6,0.2,0.5,0.05,78.2,"784","343","439",0.1,147,"1504","749","837",0.15,209.5,"2162","1218","1194",0.2,268.89999999999998,"2757","1750","1511",0.114]
["17 0007",10,3.2,0.3,null,0.65,0.35,1.1659999999999999,8.6999999999999994E-2,51.1,"979","90","378",0.17499999999999999,81.599999999999994,"1831","308","697",0.26200000000000001,98.3,"2556","652","957",0.35,108,"3154","1123","1158",0.16600000000000001]
["17 0008",10,3.2,0.4,null,0.7,0.3,0.75,7.4999999999999997E-2,75.099999999999994,"938","285","348",0.15,132.9,"1782","663","652",0.22500000000000001,179.1,"2533","1134","913",0.3,219.6,"3191","1698","1130",0.221]
["17 0009",10,3.2,0.5,null,0.85,0.35,0.7,8.6999999999999994E-2,165.3,"1336","447","492",0.17499999999999999,296.10000000000002,"2544","1021","925",0.26200000000000001,404,"3626","1721","1299",0.35,500.4,"4580","2549","1614",0.27700000000000002]
["17 0010",10,4.2,0.4,null,0.7,0.3,0.75,7.4999999999999997E-2,79.3,"860","241","405",0.15,140.30000000000001,"1632","570","760",0.22500000000000001,189.1,"2316","988","1066",0.3,231.8,"2911","1495","1322",0.20300000000000001]
["17 0011",10,4.2,0.5,null,0.75,0.25,0.5,6.2E-2,109.8,"789","359","361",0.125,206.3,"1516","778","688",0.187,294,"2182","1260","981",0.25,377.3,"2786","1803","1239",0.254]
["17 0012",10,4.2,0.6,null,0.85,0.25,0.41599999999999998,6.2E-2,181.5,"904","473","410",0.125,347.2,"1746","1008","785",0.187,502.3,"2526","1604","1125",0.25,652,"3245","2262","1432",0.30399999999999999]
["17 0013",10,5.2,0.25,null,0.55000000000000004,0.3,1.2,7.4999999999999997E-2,30.4,"654","21","380",0.15,48.2,"1217","133","702",0.22500000000000001,57.5,"1691","336","965",0.3,62.6,"2074","628","1169",0.112]
["17 0014",10,5.2,0.4,null,0.7,0.3,0.75,7.4999999999999997E-2,87.8,"857","224","485",0.15,155.30000000000001,"1623","539","912",0.22500000000000001,209.3,"2299","943","1281",0.3,256.5,"2884","1439","1591",0.18]
["17 0015",10,5.2,0.5,null,0.75,0.25,0.5,6.2E-2,121.5,"782","343","435",0.125,228.3,"1502","749","829",0.187,325.3,"2159","1218","1182",0.25,417.5,"2753","1749","1495",0.22500000000000001]
["17 0016",12,4.2,0.4,null,0.8,0.4,1,0.1,85.1,"936","149","385",0.2,141.4,"1760","411","714",0.3,178.3,"2472","786","988",0.4,205.6,"3071","1272","1205",0.311]
["17 0017",12,4.2,0.5,null,0.9,0.4,0.8,0.1,142.6,"1072","285","432",0.2,249,"2032","683","809",0.3,331.4,"2879","1193","1130",0.4,401.7,"3614","1815","1395",0.38900000000000001]
["17 0018",12,4.2,0.6,null,1,0.4,0.66600000000000004,0.1,224.1,"1208","421","480",0.2,404.9,"2303","954","904",0.3,556.79999999999995,"3286","1600","1273",0.4,694.1,"4157","2358","1585",0.46700000000000003]
["17 0019",12,5.2,0.5,null,0.9,0.4,0.8,0.1,150.4,"1015","251","493",0.2,262.7,"1921","611","923",0.3,349.6,"2717","1080","1291",0.4,423.8,"3404","1658","1596",0.36]
["17 0020",12,5.2,0.6,null,0.95,0.35,0.58299999999999996,8.6999999999999994E-2,195.9,"957","372","455",0.17499999999999999,361.2,"1830","828","863",0.26200000000000001,506.1,"2620","1367","1222",0.35,640.70000000000005,"3326","1990","1534",0.432]
["17 0021",12,6.2,0.5,null,0.85,0.35,0.7,8.6999999999999994E-2,133.5,"845","249","475",0.17499999999999999,239.2,"1605","582","894",0.26200000000000001,326.39999999999998,"2280","1001","1259",0.35,404.2,"2869","1506","1569",0.32500000000000001]
["17 0022",12,6.2,0.6,null,0.95,0.35,0.58299999999999996,8.6999999999999994E-2,213.6,"955","358","531",0.17499999999999999,393.8,"1824","801","1007",0.26200000000000001,551.70000000000005,"2608","1329","1429",0.35,698.5,"3307","1943","1795",0.39]
["17 0023",12.5,6.2,0.35,null,0.8,0.45,1.2849999999999999,0.112,83.5,"903","2","506",0.22500000000000001,129.80000000000001,"1677","134","932",0.33700000000000002,151.19999999999999,"2323","393","1278",0.45,160.19999999999999,"2840","782","1542",0.254]
["17 0024",12.5,6.2,0.5,null,0.85,0.35,0.7,8.6999999999999994E-2,120,"775","231","420",0.17499999999999999,215.1,"1473","539","791",0.26200000000000001,293.39999999999998,"2093","925","1114",0.35,363.4,"2635","1389","1388",0.36299999999999999]
["17 0025",12.5,6.2,0.7,null,1,0.3,0.42799999999999999,7.4999999999999997E-2,239.4,"804","403","425",0.15,456.8,"1550","864","814",0.22500000000000001,659.5,"2240","1382","1167",0.3,854.9,"2872","1957","1484",0.50800000000000001]
["17 0026",14,7.2,0.35,null,0.8,0.45,1.2849999999999999,0.112,68,"723","-11","418",0.22500000000000001,105.7,"1343","103","770",0.33700000000000002,123.2,"1860","309","1055",0.45,130.5,"2273","619","1274",0.311]
["17 0027",14,7.2,0.5,null,0.9,0.4,0.8,0.1,120.1,"745","173","419",0.2,209.8,"1408","428","787",0.3,279.2,"1990","764","1101",0.4,338.4,"2490","1182","1363",0.44400000000000001]
["17 0028",14,7.2,0.8,null,1.1000000000000001,0.3,0.375,7.4999999999999997E-2,283.8,"712","390","386",0.15,547.20000000000005,"1377","826","743",0.22500000000000001,796.8,"1997","1308","1071",0.3,1040,"2571","1836","1369",0.71099999999999997]
["17 0029",15,5.2,0.4,null,0.95,0.55000000000000004,1.375,0.13700000000000001,101.2,"957","3","401",0.27500000000000002,154.4,"1777","142","735",0.41199999999999998,175.5,"2462","417","1002",0.55000000000000004,180.7,"3010","828","1202",0.48799999999999999]
["17 0030",15,5.2,0.5,null,1,0.5,1,0.125,132.80000000000001,"939","151","383",0.25,220.6,"1766","414","711",0.375,278.2,"2480","790","983",0.5,320.89999999999998,"3082","1279","1199",0.61]
["17 0031",15,5.2,0.6,null,1.05,0.45,0.75,0.112,170.8,"908","269","361",0.22500000000000001,302.10000000000002,"1725","630","678",0.33700000000000002,407.2,"2451","1082","949",0.45,499,"3085","1625","1176",0.73199999999999998]
["17 0032",15,5.2,0.7,null,1.25,0.55000000000000004,0.78500000000000003,0.13700000000000001,340.2,"1317","362","526",0.27500000000000002,596.4,"2497","861","985",0.41199999999999998,796.5,"3541","1496","1376",0.55000000000000004,968.6,"4449","2268","1701",0.85399999999999998]
["17 0033",15,6.2,0.5,null,1,0.5,1,0.125,138.1,"895","129","424",0.25,229.4,"1680","368","787",0.375,289.39999999999998,"2356","716","1089",0.5,333.7,"2923","1173","1331",0.57499999999999996]
["17 0034",15,6.2,0.6,null,1.05,0.45,0.75,0.112,177.6,"863","243","400",0.22500000000000001,314.2,"1638","574","752",0.33700000000000002,423.5,"2323","994","1054",0.45,519,"2921","1503","1307",0.69]
["17 0035",15,6.2,0.7,null,1.1000000000000001,0.4,0.57099999999999995,0.1,222.4,"818","328","373",0.2,411.1,"1567","727","707",0.3,577.5,"2245","1195","1002",0.4,732.6,"2854","1734","1258",0.80500000000000005]
["17 0036",15,8.1999999999999993,0.7,null,1.1000000000000001,0.4,0.57099999999999995,0.1,256.3,"819","311","479",0.2,473.9,"1566","694","909",0.3,665.6,"2240","1150","1291",0.4,844.4,"2841","1679","1624",0.68100000000000005]
["17 0037",15,8.1999999999999993,0.8,null,1.2,0.4,0.5,0.1,366.8,"900","391","523",0.2,689.3,"1727","856","997",0.3,982.3,"2482","1392","1423",0.4,1261,"3164","2002","1800",0.77800000000000002]
["17 0038",16,8.1999999999999993,0.4,null,0.9,0.5,1.25,0.125,83.7,"693","10","399",0.25,131.19999999999999,"1289","117","735",0.375,154.30000000000001,"1786","322","1009",0.5,165.4,"2186","624","1220",0.46500000000000002]
["17 0039",16,8.1999999999999993,0.6,null,1.05,0.45,0.75,0.112,172,"751","197","420",0.22500000000000001,304.3,"1423","474","790",0.33700000000000002,410,"2016","830","1109",0.45,502.5,"2530","1264","1377",0.69799999999999995]
["17 0040",16,8.1999999999999993,0.9,null,1.25,0.35,0.38800000000000001,8.6999999999999994E-2,362.5,"721","386","391",0.17499999999999999,697,"1394","820","751",0.26200000000000001,1013,"2019","1301","1080",0.35,1319,"2596","1831","1379",1.0469999999999999]
["17 0041",18,6.2,0.4,null,1,0.6,1.5,0.15,84.6,"759","-30","319",0.3,126.1,"1406","52","583",0.45,138.6,"1940","247","791",0.6,136.69999999999999,"2361","555","944",0.70399999999999996]
["17 0042",18,6.2,0.5,null,1.1000000000000001,0.6,1.2,0.15,129.9,"851","61","350",0.3,205.7,"1588","234","646",0.45,245.4,"2213","520","885",0.6,267,"2725","920","1070",0.88]
["17 0043",18,6.2,0.6,null,1.2,0.6,1,0.15,191.1,"942","152","382",0.3,317.3,"1770","416","708",0.45,400.3,"2486","794","980",0.6,461.6,"3090","1284","1195",1.056]
["17 0044",18,6.2,0.7,null,1.4,0.7,1,0.17499999999999999,354.1,"1282","207","520",0.35,588,"2410","567","964",0.52500000000000002,741.7,"3384","1080","1333",0.7,855.2,"4205","1748","1627",1.232]
["17 0045",18,6.2,0.8,null,1.5,0.7,0.875,0.17499999999999999,479.5,"1388","313","556",0.35,821.6,"2622","779","1037",0.52500000000000002,1072,"3703","1399","1443",0.7,1277,"4630","2173","1774",1.4079999999999999]
["17 0046",18,8.1999999999999993,0.7,null,1.25,0.55000000000000004,0.78500000000000003,0.13700000000000001,254.6,"858","216","434",0.27500000000000002,446.2,"1624","523","815",0.41199999999999998,596,"2298","922","1141",0.55000000000000004,724.7,"2881","1413","1412",1.1080000000000001]
["17 0047",18,8.1999999999999993,0.8,null,1.3,0.5,0.625,0.125,308.89999999999998,"823","292","411",0.25,563.79999999999995,"1570","660","777",0.375,782.6,"2242","1104","1098",0.5,983.5,"2837","1624","1375",1.266]
["17 0048",18,8.1999999999999993,1,null,1.5,0.5,0.5,0.125,559,"963","432","475",0.25,1051,"1849","939","904",0.375,1497,"2660","1523","1289",0.5,1921,"3395","2182","1629",1.5820000000000001]
["17 0049",18,9.1999999999999993,0.45,null,1.05,0.6,1.333,0.15,120.7,"763","-14","440",0.3,185.8,"1415","83","809",0.45,213.7,"1957","291","1106",0.6,222.9,"2387","610","1333",0.66400000000000003]
["17 0050",18,9.1999999999999993,0.7,null,1.2,0.5,0.71399999999999997,0.125,233.4,"756","216","421",0.25,416.6,"1434","509","792",0.375,566.4,"2035","879","1114",0.5,699.4,"2560","1326","1387",1.0329999999999999]
["17 0051",18,9.1999999999999993,1,null,1.4,0.4,0.4,0.1,450.6,"728","382","394",0.2,865,"1406","814","757",0.3,1254,"2035","1295","1088",0.4,1631,"2615","1826","1387",1.476]
["17 0052",20,8.1999999999999993,0.5,null,1.1499999999999999,0.65,1.3,0.16200000000000001,128.30000000000001,"739","11","355",0.32500000000000001,198.8,"1375","126","652",0.48699999999999999,230.8,"1906","345","892",0.65,243.4,"2333","668","1074",1.026]
["17 0053",20,8.1999999999999993,0.6,null,1.3,0.7,1.1659999999999999,0.17499999999999999,214.4,"907","63","432",0.35,342.1,"1694","246","797",0.52500000000000002,412,"2360","550","1095",0.7,453,"2905","974","1327",1.2310000000000001]
["17 0054",20,8.1999999999999993,0.7,null,1.35,0.65,0.92800000000000005,0.16200000000000001,261.5,"890","161","416",0.32500000000000001,442,"1675","426","775",0.48699999999999999,568.5,"2356","795","1076",0.65,668,"2934","1269","1320",1.4359999999999999]
["17 0055",20,8.1999999999999993,0.8,null,1.4,0.6,0.75,0.15,315,"865","244","398",0.3,557.29999999999995,"1640","576","748",0.45,751,"2328","998","1048",0.6,920.5,"2926","1507","1300",1.641]
["17 0056",20,8.1999999999999993,0.9,null,1.5,0.6,0.66600000000000004,0.15,423.2,"934","313","427",0.3,764.5,"1779","715","804",0.45,1051,"2535","1205","1133",0.6,1311,"3203","1784","1413",1.8460000000000001]
["17 0057",20,8.1999999999999993,1,null,1.6,0.6,0.6,0.15,555.6,"1003","382","455",0.3,1020,"1917","853","861",0.45,1424,"2743","1413","1218",0.6,1798,"3480","2062","1527",2.0510000000000002]
["17 0058",20,10.199999999999999,0.4,null,0.9,0.5,1.25,0.125,53.4,"443","6","254",0.25,83.7,"824","75","468",0.375,98.5,"1142","206","642",0.5,105.5,"1398","400","777",0.73]
["17 0059",20,10.199999999999999,0.5,null,1.1499999999999999,0.65,1.3,0.16200000000000001,141.30000000000001,"734","-4","422",0.32500000000000001,218.9,"1363","98","776",0.48699999999999999,254.1,"1887","305","1063",0.65,268,"2305","617","1283",0.91200000000000003]
["17 0060",20,10.199999999999999,0.8,null,1.35,0.55000000000000004,0.68700000000000006,0.13700000000000001,304.3,"759","230","421",0.27500000000000002,546.79999999999995,"1442","536","793",0.41199999999999998,748.2,"2050","917","1118",0.55000000000000004,929,"2582","1374","1394",1.46]
["17 0061",20,10.199999999999999,0.9,null,1.45,0.55000000000000004,0.61099999999999999,0.13700000000000001,411.7,"821","292","452",0.27500000000000002,754,"1566","659","856",0.41199999999999998,1050,"2235","1102","1212",0.55000000000000004,1323,"2829","1621","1520",1.6419999999999999]
["17 0062",20,10.199999999999999,1,null,1.55,0.55000000000000004,0.55000000000000004,0.13700000000000001,543.6,"882","354","484",0.27500000000000002,1010,"1689","783","920",0.41199999999999998,1425,"2421","1288","1307",0.55000000000000004,1815,"3077","1868","1646",1.8240000000000001]
["17 0063",20,10.199999999999999,1.1000000000000001,null,1.55,0.45,0.40899999999999997,0.112,548.20000000000005,"733","379","397",0.22500000000000001,1050,"1416","809","761",0.33700000000000002,1521,"2048","1290","1093",0.45,1976,"2630","1821","1393",2.0070000000000001]
["17 0064",22.5,11.2,0.6,null,1.4,0.8,1.33,0.2,240.4,"865","-14","488",0.4,369.9,"1605","98","897",0.6,425.4,"2219","336","1227",0.8,443.9,"2708","699","1478",1.409]
["17 0065",22.5,11.2,0.8,null,1.45,0.65,0.81200000000000006,0.16200000000000001,306.3,"751","171","412",0.32500000000000001,533.4,"1420","425","771",0.48699999999999999,707.4,"2006","762","1079",0.65,855.1,"2508","1182","1335",1.8779999999999999]
["17 0066",23,8.1999999999999993,0.7,null,1.5,0.8,1.1419999999999999,0.2,279.39999999999998,"940","87","397",0.4,448.4,"1758","295","733",0.6,543.6,"2454","626","1007",0.8,601.9,"3028","1078","1221",1.9930000000000001]
["17 0067",23,8.1999999999999993,0.8,null,1.55,0.75,0.93700000000000006,0.187,332,"925","175","384",0.375,560,"1743","457","714",0.56200000000000006,718.5,"2453","846","991",0.75,842.4,"3057","1343","1214",2.2770000000000001]
["17 0068",23,8.1999999999999993,0.9,null,1.7,0.8,0.88800000000000001,0.2,485.7,"1086","233","449",0.4,829.2,"2051","589","837",0.6,1078,"2894","1066","1164",0.8,1279,"3615","1665","1430",2.5609999999999999]
["17 0069",23,10.199999999999999,0.9,null,1.65,0.75,0.83299999999999996,0.187,463.1,"944","213","469",0.375,801.9,"1784","531","877",0.56200000000000006,1058,"2520","953","1225",0.75,1273,"3151","1480","1512",2.3570000000000002]
["17 0070",23,10.199999999999999,1,null,1.7,0.7,0.7,0.17499999999999999,538.20000000000005,"919","282","451",0.35,964.2,"1746","655","849",0.52500000000000002,1315,"2483","1119","1195",0.7,1629,"3129","1673","1487",2.6190000000000002]
["17 0071",23,12.2,1,null,1.6,0.6,0.6,0.15,474.7,"753","271","429",0.3,871.7,"1436","612","813",0.45,1217,"2052","1020","1152",0.6,1536,"2598","1498","1446",2.343]
["17 0072",25,12.2,0.7,null,1.6,0.9,1.2849999999999999,0.22500000000000001,331.2,"902","4","499",0.45,514.6,"1675","136","919",0.67500000000000004,599.6,"2320","396","1259",0.9,635.4,"2837","785","1519",2.0550000000000002]
["17 0073",25,12.2,0.9,null,1.6,0.7,0.77700000000000002,0.17499999999999999,366.8,"724","181","389",0.35,644.29999999999995,"1371","440","730",0.52500000000000002,862.3,"1940","776","1023",0.7,1050,"2432","1190","1268",2.6419999999999999]
["17 0074",28,10.199999999999999,0.8,null,1.75,0.95,1.1870000000000001,0.23699999999999999,347.9,"870","62","375",0.47499999999999998,552.5,"1624","239","692",0.71199999999999997,661.5,"2264","532","950",0.95,722.7,"2787","940","1149",3.3540000000000001]
["17 0075",28,10.199999999999999,1,null,2,1,1,0.25,615.20000000000005,"1061","165","451",0.5,1022,"1994","459","837",0.75,1289,"2798","880","1158",1,1486,"3475","1429","1414",4.1909999999999998]
["17 0076",28,12.2,1,null,1.95,0.95,0.95,0.23699999999999999,589.9,"947","156","467",0.47499999999999998,991.7,"1781","425","870",0.71199999999999997,1268,"2502","807","1208",0.95,1482,"3111","1302","1480",3.9140000000000001]
["17 0077",28,14.2,0.8,null,1.8,1,1.25,0.25,434.8,"904","13","515",0.5,681,"1680","154","950",0.75,801.4,"2330","422","1304",1,858.8,"2852","817","1577",2.8719999999999999]
["17 0078",28,14.2,1,null,1.8,0.8,0.8,0.2,476.4,"744","174","414",0.4,832,"1406","429","776",0.6,1107,"1986","765","1086",0.8,1342,"2486","1183","1344",3.59]
["17 0079",31.5,16.3,0.8,null,1.85,1.05,1.3120000000000001,0.26200000000000001,384.3,"771","-9","448",0.52500000000000002,593.79999999999995,"1430","94","825",0.78700000000000003,686.8,"1978","308","1130",1.05,721.6,"2415","633","1363",3.5830000000000002]
["17 0080",34,12.3,1,null,2.2000000000000002,1.2,1.2,0.3,587.20000000000005,"938","63","403",0.6,930,"1751","250","742",0.9,1110,"2439","563","1018",1.2,1208,"3002","1001","1231",6.194]
["17 0081",35.5,18.3,0.9,null,2.0499999999999998,1.1499999999999999,1.2769999999999999,0.28699999999999998,457.7,"737","2","427",0.57499999999999996,712.4,"1370","108","786",0.86199999999999999,831.9,"1897","320","1078",1.1499999999999999,883.8,"2319","637","1302",5.1340000000000003]
["17 0082",40,20.399999999999999,1,null,2.2999999999999998,1.3,1.3,0.32500000000000001,565.29999999999995,"734","-4","422",0.65,875.8,"1363","98","776",0.97499999999999998,1017,"1887","305","1063",1.3,1072,"2305","617","1283",7.2990000000000004]
["18 0001",22.5,11.2,1.25,null,1.75,0.5,0.4,0.125,693.1,"726","383","384",0.25,1330,"1403","815","737",0.375,1929,"2031","1296","1059",0.5,2509,"2610","1825","1350",2.9350000000000001]
["18 0002",23,12.2,1.25,null,1.85,0.6,0.48,0.15,863.4,"881","399","497",0.3,1630,"1692","868","949",0.45,2331,"2436","1404","1356",0.6,3000,"3110","2010","1718",2.9289999999999998]
["18 0003",23,12.2,1.5,null,2.1,0.6,0.4,0.15,1432,"1009","527","565",0.3,2748,"1948","1124","1085",0.45,3986,"2820","1788","1560",0.6,5184,"3622","2522","1990",3.5139999999999998]
["18 0004",25,12.2,1.5,null,2.0499999999999998,0.55000000000000004,0.36599999999999999,0.13700000000000001,1040,"761","425","393",0.27500000000000002,2007,"1473","898","757",0.41199999999999998,2926,"2138","1419","1091",0.55000000000000004,3821,"2755","1988","1395",4.4029999999999996]
["18 0005",28,10.199999999999999,1.25,null,2.25,1,0.8,0.25,1030,"1214","319","507",0.5,1799,"2300","765","949",0.75,2394,"3258","1340","1326",1,2902,"4089","2042","1637",5.2380000000000004]
["18 0006",28,10.199999999999999,1.5,null,2.2000000000000002,0.7,0.46600000000000003,0.17499999999999999,1003,"863","424","346",0.35,1899,"1663","911","660",0.52500000000000002,2723,"2401","1461","943",0.7,3511,"3076","2074","1193",6.2859999999999996]
["18 0007",28,12.2,1.25,null,2.1,0.85,0.68,0.21199999999999999,843.8,"934","300","451",0.42499999999999999,1519,"1777","691","849",0.63700000000000001,2083,"2529","1172","1196",0.85,2590,"3191","1743","1491",4.8929999999999998]
["18 0008",28,12.2,1.5,null,2.25,0.75,0.5,0.187,1149,"900","406","426",0.375,2159,"1729","883","812",0.56200000000000006,3077,"2488","1431","1157",0.75,3949,"3176","2049","1462",5.8719999999999999]
["18 0009",28,14.2,1.25,null,2.1,0.85,0.68,0.21199999999999999,907.4,"931","287","513",0.42499999999999999,1634,"1770","667","968",0.63700000000000001,2240,"2516","1138","1365",0.85,2785,"3171","1701","1703",4.4859999999999998]
["18 0010",28,14.2,1.5,null,2.15,0.65,0.433,0.16200000000000001,1033,"747","371","403",0.32500000000000001,1970,"1440","795","772",0.48699999999999999,2841,"2080","1274","1106",0.65,3680,"2665","1806","1407",5.3860000000000001]
["18 0011",31.5,16.3,1.25,null,2.15,0.9,0.72,0.22500000000000001,790.5,"797","224","449",0.45,1409,"1512","530","844",0.67500000000000004,1913,"2145","917","1187",0.9,2359,"2696","1386","1478",5.5990000000000002]
["18 0012",31.5,16.3,1.5,null,2.4,0.9,0.6,0.22500000000000001,1260,"899","326","501",0.45,2314,"1716","734","950",0.67500000000000004,3230,"2451","1223","1346",0.9,4077,"3104","1795","1689",6.7169999999999996]
["18 0013",31.5,16.3,1.75,null,2.4500000000000002,0.7,0.4,0.17499999999999999,1391,"729","382","399",0.35,2669,"1408","814","766",0.52500000000000002,3871,"2038","1296","1102",0.7,5036,"2619","1826","1405",7.8390000000000004]
["18 0014",31.5,16.3,2,null,2.75,0.75,0.375,0.187,2199,"879","481","480",0.375,4239,"1702","1020","924",0.56200000000000006,6173,"2467","1615","1331",0.75,8054,"3176","2267","1701",8.9559999999999995]
["18 0015",34,12.3,1.25,null,2.4500000000000002,1.2,0.96,0.3,946.4,"1063","188","448",0.6,1587,"2001","500","833",0.9,2024,"2814","938","1154",1.2,2359,"3502","1501","1412",7.7430000000000003]
["18 0016",34,12.3,1.5,null,2.7,1.2,0.8,0.3,1447,"1188","313","493",6,2527,"2251","750","923",0.9,3363,"3190","1313","1290",1.2,4076,"4003","2001","1593",9.2799999999999994]
["18 0017",34,14.3,1.25,null,2.4,1.1499999999999999,0.92,0.28699999999999998,912.8,"964","177","461",0.57499999999999996,1546,"1816","466","858",0.86199999999999999,1993,"2555","868","1193",1.1499999999999999,2347,"3182","1382","1464",7.33]
["18 0018",34,14.3,1.5,null,2.5499999999999998,1.05,0.7,0.26200000000000001,1224,"953","297","447",0.52500000000000002,2192,"1813","687","841",0.78700000000000003,2990,"2579","1172","1183",1.05,3704,"3250","1750","1472",8.7989999999999995]
["18 0019",34,16.3,1.5,null,2.5499999999999998,1.05,0.7,0.26200000000000001,1291,"942","283","495",0.52500000000000002,2313,"1790","660","933",0.78700000000000003,3155,"2543","1131","1313",1.05,3908,"3203","1696","1635",8.2330000000000005]
["18 0020",34,16.3,2,null,2.85,0.85,0.42499999999999999,0.21199999999999999,2097,"877","445","449",0.42499999999999999,4003,"1692","952","860",0.63700000000000001,5783,"2446","1520","1234",0.85,7498,"3138","2150","1570",10.978]
["18 0021",35.5,18.3,1.25,null,2.25,1,0.8,0.25,730.9,"724","168","409",0.5,1277,"1369","416","766",0.75,1699,"1935","743","1073",1,2059,"2421","1149","1329",7.1310000000000002]
["18 0022",35.5,18.3,2,null,2.8,0.8,0.4,0.2,1864,"749","393","409",0.4,3576,"1448","837","785",0.6,5187,"2095","1332","1128",0.8,6747,"2692","1878","1439",11.41]
["18 0023",40,14.3,1.25,null,2.65,1.4,1.1200000000000001,0.35,904.4,"961","98","406",0.7,1459,"1799","319","750",1.05,1780,"2514","664","1033",1.4,1984,"3105","1132","1253",10.755000000000001]
["18 0024",40,14.3,1.5,null,2.8,1.3,0.86599999999999999,0.32500000000000001,1188,"962","218","398",0.65,2040,"1818","542","743",0.97499999999999998,2668,"2568","973","1034",1.3,3184,"3212","1510","1271",12.904999999999999]
["18 0025",40,14.3,1.75,null,3.05,1.3,0.74199999999999999,0.32500000000000001,1722,"1061","316","433",0.65,3051,"2015","739","813",0.97499999999999998,4119,"2863","1268","1139",1.3,5056,"3605","1904","1412",15.055999999999999]
["18 0026",40,14.3,2,null,3.05,1.05,0.52500000000000002,0.26200000000000001,1800,"878","393","349",0.52500000000000002,3363,"1688","855","664",0.78700000000000003,4769,"2427","1387","943",1.05,6096,"3098","1988","1188",17.207000000000001]
["18 0027",40,16.3,1.5,null,2.8,1.3,0.86599999999999999,0.32500000000000001,1224,"928","199","430",0.65,2102,"1752","503","802",0.97499999999999998,2749,"2472","911","1118",1.3,3281,"3088","1422","1376",12.339]
["18 0028",40,16.3,1.75,null,3.1,1.35,0.77100000000000002,0.33700000000000002,1881,"1076","290","494",0.67500000000000004,3309,"2040","692","926",1.012,4435,"2891","1207","1297",1.35,5410,"3631","1834","1606",14.396000000000001]
["18 0029",40,16.3,2,null,3.1,1.1000000000000001,0.55000000000000004,0.27500000000000002,1972,"897","375","402",0.55000000000000004,3663,"1719","825","764",0.82499999999999996,5169,"2467","1349","1084",1.1000000000000001,6580,"3141","1948","1364",16.498999999999999]
["18 0030",40,18.3,2,null,3.15,1.1499999999999999,0.57499999999999996,0.28699999999999998,2182,"933","365","466",0.57499999999999996,4030,"1785","810","883",0.86199999999999999,5656,"2556","1338","1252",1.1499999999999999,7171,"3246","1946","1573",15.599]
["18 0031",40,20.399999999999999,1.5,null,2.65,1.1499999999999999,0.76600000000000001,0.28699999999999998,1109,"774","196","431",0.57499999999999996,1953,"1465","474","810",0.86199999999999999,2621,"2073","835","1136",1.1499999999999999,3201,"2599","1278","1410",10.948]
["18 0032",40,20.399999999999999,2,null,3.1,1.1000000000000001,0.55000000000000004,0.27500000000000002,2175,"882","354","484",0.55000000000000004,4041,"1689","783","920",0.82499999999999996,5701,"2421","1288","1307",1.1000000000000001,7258,"3077","1868","1646",14.59]
["18 0033",40,20.399999999999999,2.25,null,3.15,0.9,0.4,0.22500000000000001,2336,"746","392","403",0.45,4481,"1441","835","774",0.67500000000000004,6500,"2086","1328","1112",0.9,8456,"2680","1871","1419",16.422000000000001]
["18 0034",40,20.399999999999999,2.5,null,3.45,0.95,0.38,0.23699999999999999,3351,"864","470","466",0.47499999999999998,6453,"1673","997","896",0.71199999999999997,9390,"2424","1579","1290",0.95,12243,"3120","2219","1649",18.245999999999999]
["18 0035",45,22.4,1.25,null,2.85,1.6,1.28,0.4,1041,"883","4","497",0.8,1620,"1641","134","914",1.2,1891,"2273","389","1253",1.6,2007,"2779","770","1514",11.739000000000001]
["18 0036",45,22.4,1.75,null,3.05,1.3,0.74199999999999999,0.32500000000000001,1524,"795","214","433",0.65,2701,"1507","512","814",0.97499999999999998,3646,"2135","892","1144",1.3,4475,"2681","1355","1421",16.434000000000001]
["18 0037",45,22.4,2.5,null,3.5,1,0.4,0.25,2773,"726","383","384",0.5,5320,"1403","815","737",0.75,7716,"2031","1296","1059",1,10037,"2610","1825","1350",23.478000000000002]
["18 0038",48,16.3,1.5,null,3,1.5,1,0.375,1048,"832","135","333",0.75,1740,"1564","370","618",1.125,2195,"2197","704","855",1.5,2531,"2730","1138","1043",18.850000000000001]
["18 0039",50,18.399999999999999,1.25,null,2.85,1.6,1.28,0.4,756.9,"742","24","325",0.8,1178,"1381","151","597",1.2,1375,"1918","380","817",1.6,1459,"2352","712","984",16.657]
["18 0040",50,18.399999999999999,1.5,null,3.15,1.65,1.1000000000000001,0.41199999999999998,1166,"855","93","370",0.82499999999999996,1890,"1602","294","684",1.2370000000000001,2319,"2239","605","942",1.65,2600,"2768","1024","1144",19.988]
["18 0041",50,18.399999999999999,2,null,3.65,1.65,0.82499999999999996,0.41199999999999998,2229,"1013","251","428",0.82499999999999996,3868,"1918","610","800",1.2370000000000001,5114,"2713","1079","1116",1.65,6163,"3400","1656","1377",26.651]
["18 0042",50,18.399999999999999,2.5,null,4.1500000000000004,1.65,0.66,0.41199999999999998,3870,"1171","409","486",0.82499999999999996,7002,"2234","926","916",1.2370000000000001,9643,"3187","1552","1291",1.65,12038,"4032","2288","1609",33.314]
["18 0043",50,18.399999999999999,3,null,4.2,1.2,0.4,0.3,4179,"891","488","357",0.6,8018,"1725","1033","685",0.9,11630,"2500","1636","983",1.2,15128,"3219","2296","1251",39.976999999999997]
["18 0044",50,20.399999999999999,2,null,3.5,1.5,0.75,0.375,1966,"865","244","397",0.75,3478,"1642","578","745",1.125,4687,"2330","1000","1045",1.5,5745,"2929","1510","1295",25.695]
["18 0045",50,20.399999999999999,2.5,null,3.85,1.35,0.54,0.33700000000000002,3008,"876","373","393",0.67500000000000004,5601,"1680","817","746",1.012,7919,"2412","1334","1060",1.35,10098,"3072","1922","1335",32.118000000000002]
["18 0046",50,22.4,2,null,3.6,1.6,0.8,0.4,2247,"932","228","466",0.8,3924,"1763","556","872",1.2,5222,"2493","985","1220",1.6,6329,"3123","1514","1509",24.638999999999999]
["18 0047",50,22.4,2.5,null,3.9,1.4,0.56000000000000005,0.35,3261,"904","364","442",0.7,6044,"1730","806","838",1.05,8510,"2480","1324","1190",1.4,10817,"3152","1920","1496",30.798999999999999]
["18 0048",50,25.4,1.25,null,2.85,1.6,1.28,0.4,853.7,"717","2","410",0.8,1328,"1332","106","755",1.2,1550,"1845","312","1035",1.6,1646,"2256","621","1251",14.294]
["18 0049",50,25.4,1.5,null,3.1,1.6,1.0660000000000001,0.4,1242,"789","74","447",0.8,2028,"1476","250","828",1.2,2512,"2061","528","1145",1.6,2844,"2543","909","1397",17.152999999999999]
["18 0050",50,25.4,2,null,3.4,1.4,0.7,0.35,1949,"777","230","430",0.7,3491,"1476","537","810",1.05,4762,"2097","923","1140",1.4,5898,"2639","1388","1421",22.870999999999999]
["18 0051",50,25.4,2.25,null,3.75,1.5,0.66600000000000004,0.375,2905,"921","292","508",0.75,5249,"1752","675","959",1.125,7217,"2494","1147","1353",1.5,8997,"3145","1709","1690",25.73]
["18 0052",50,25.4,2.5,null,3.9,1.4,0.56000000000000005,0.35,3473,"903","355","494",0.7,6437,"1728","789","938",1.05,9063,"2474","1301","1332",1.4,11519,"3143","1891","1677",28.588999999999999]
["18 0053",50,25.4,3,null,4.0999999999999996,1.1000000000000001,0.36599999999999999,0.27500000000000002,4255,"762","424","409",0.55000000000000004,8214,"1476","897","787",0.82499999999999996,11976,"2142","1418","1135",1.1000000000000001,15640,"2759","1987","1451",34.305999999999997]
["18 0054",56,28.5,1.5,null,3.45,1.95,1.3,0.48699999999999999,1458,"843","-4","483",0.97499999999999998,2259,"1565","112","889",1.462,2622,"2165","350","1218",1.95,2766,"2645","709","1470",21.489000000000001]
["18 0055",56,28.5,2,null,3.6,1.6,0.8,0.4,1910,"744","173","415",0.8,3335,"1406","428","778",1.2,4438,"1987","765","1090",1.6,5379,"2486","1183","1349",28.652999999999999]
["18 0056",56,28.5,2.5,null,4.2,1.7,0.68,0.42499999999999999,3638,"931","287","515",0.85,6550,"1770","666","972",1.2749999999999999,8978,"2517","1138","1369",1.7,11164,"3173","1701","1709",35.816000000000003]
["18 0057",56,28.5,3,null,4.3,1.3,0.433,0.32500000000000001,4142,"747","371","404",0.65,7895,"1441","795","775",0.97499999999999998,11388,"2080","1274","1110",1.3,14752,"2666","1806","1412",42.978999999999999]
["18 0058",60,20.5,2,null,4.2,2.2000000000000002,1.1000000000000001,0.55000000000000004,2528,"1082","125","440",1.1000000000000001,4097,"2028","386","812",1.65,5026,"2837","784","1119",2.2000000000000002,5636,"3509","1320","1358",39.207999999999998]
["18 0059",60,20.5,2.5,null,4.7,2.2000000000000002,0.88,0.55000000000000004,4151,"1233","276","491",1.1000000000000001,7102,"2330","688","916",1.65,9255,"3289","1237","1273",2.2000000000000002,11008,"4112","1923","1564",49.009]
["18 0060",60,20.5,3,null,5.2,2.2000000000000002,0.73299999999999998,0.55000000000000004,6434,"1384","426","543",1.1000000000000001,11429,"2631","990","1019",1.65,15465,"3742","1690","1428",2.2000000000000002,19022,"4716","2527","1771",58.811]
["18 0061",60,25.5,2.5,null,4.4000000000000004,1.9,0.76,0.47499999999999998,3447,"949","259","451",0.95,6081,"1799","616","847",1.425,8175,"2551","1072","1187",1.9,9997,"3204","1627","1471",45.465000000000003]
["18 0062",60,25.5,3,null,4.6500000000000004,1.65,0.55000000000000004,0.41199999999999998,4495,"889","369","414",0.82499999999999996,8352,"1704","812","787",1.2370000000000001,11784,"2445","1330","1117",1.65,15002,"3111","1922","1405",54.557000000000002]
["18 0063",60,30.5,2.5,null,4.5,2,0.8,0.5,4059,"1012","236","564",1,7088,"1914","583","1058",1.5,9432,"2704","1041","1481",2,11433,"3384","1610","1834",41.149000000000001]
["18 0064",60,30.5,2.75,null,4.75,2,0.72699999999999998,0.5,5125,"1075","299","596",1,9117,"2039","708","1122",1.5,12356,"2892","1228","1576",2,15217,"3634","1860","1961",45.264000000000003]
["18 0065",60,30.5,3,null,4.7,1.7,0.56599999999999995,0.42499999999999999,5083,"917","356","502",0.85,9407,"1754","793","953",1.2749999999999999,13226,"2511","1309","1353",1.7,16792,"3188","1906","1703",57.607999999999997]
["18 0066",60,30.5,3.5,null,5,1.5,0.42799999999999999,0.375,6591,"874","437","472",0.75,12574,"1685","937","905",1.125,18153,"2434","1499","1297",1.5,23528,"3121","2123","1650",57.607999999999997]
["18 0067",63,31,1.8,null,4.1500000000000004,2.35,1.3049999999999999,0.58699999999999997,2364,"961","-4","536",1.175,3658,"1785","130","986",1.762,4238,"2470","402","1351",2.35,4463,"3018","811","1629",33.381]
["18 0068",63,31,2.5,null,4.25,1.75,0.7,0.437,2942,"763","227","410",0.875,5270,"1449","531","773",1.3120000000000001,7189,"2059","912","1088",1.75,8904,"2592","1368","1355",46.362000000000002]
["18 0069",63,31,3,null,4.7,1.7,0.56599999999999995,0.42499999999999999,4524,"830","324","441",0.85,8373,"1587","721","838",1.2749999999999999,11772,"2273","1190","1189",1.7,14946,"2886","1731","1495",56.634999999999998]
["18 0070",63,31,3.5,null,4.9000000000000004,1.4,0.4,0.35,5399,"726","383","380",0.7,10359,"1403","815","729",1.05,15025,"2030","1296","1047",1.4,19545,"2609","1826","1335",64.906999999999996]
["18 0071",70,24.5,3,null,5.3,2.2999999999999998,0.76600000000000001,0.57499999999999996,5080,"1070","306","430",1.1499999999999999,8948,"2031","721","806",1.7250000000000001,12007,"2883","1245","1128",2.2999999999999998,14663,"3626","1878","1396",79.525999999999996]
["18 0072",70,24.5,3.5,null,6,2.5,0.71399999999999997,0.625,8446,"1324","421","529",1.25,15076,"2519","971","994",1.875,20495,"3585","1650","1395",2.5,25309,"4522","2458","1733",92.781000000000006]
["18 0073",70,25.5,2,null,4.5,2.5,1.25,0.625,2408,"938","43","406",1.25,3771,"1748","214","748",1.875,4437,"2431","512","1024",2.5,4755,"2985","939","1235",52.401000000000003]
["18 0074",70,30.5,2.5,null,4.9000000000000004,2.4,0.96,0.6,3755,"961","153","475",1.2,6297,"1807","422","883",1.8,8031,"2538","806","1225",2.4,9360,"3153","1306","1501",61.186]
["18 0075",70,30.5,3,null,5.0999999999999996,2.1,0.7,0.52500000000000002,4676,"895","276","433",1.05,8376,"1701","640","814",1.575,11426,"2418","1093","1145",2.1,14152,"3048","1634","1426",73.423000000000002]
["18 0076",70,35.5,3,null,5.0999999999999996,2.1,0.7,0.52500000000000002,5028,"891","264","493",1.05,9007,"1694","617","928",1.575,12287,"2407","1060","1307",2.1,15218,"3029","1593","1628",67.319000000000003]
["18 0077",70,35.5,3.5,null,5.3,1.8,0.51400000000000001,0.45,6077,"809","347","440",0.9,11384,"1551","760","837",1.35,16177,"2228","1239","1193",1.8,20714,"2839","1784","1507",78.539000000000001]
["18 0078",70,35.5,4,null,5.8,1.8,0.45,0.45,8757,"891","430","482",0.9,16634,"1716","925","921",1.35,23923,"2476","1486","1319",1.8,30919,"3169","2114","1675",89.759]
["18 0080",70,40.5,4,null,5.7,1.7,0.42499999999999999,0.42499999999999999,9025,"858","424","521",0.85,17230,"1654","910","1000",1.2749999999999999,24889,"2388","1459","1435",1.7,32274,"3059","2069","1827",80.388000000000005]
["18 0082",70,40.5,5,null,6.4,1.4,0.28000000000000003,0.35,13646,"807","513","484",0.7,26719,"1572","1068","938",1.05,39410,"2295","1665","1364",1.4,51911,"2975","2303","1760",100.485]
["18 0084",71,36,2,null,4.5999999999999996,2.6,1.3,0.65,2861,"932","-5","532",1.3,4432,"1730","125","980",1.95,5144,"2394","388","1342",2.6,5426,"2924","784","1620",46.177]
["18 0085",71,36,2.5,null,4.5,2,0.8,0.5,2894,"723","169","402",1,5054,"1366","417","754",1.5,6725,"1931","744","1055",2,8152,"2416","1150","1306",57.722000000000001]
["18 0086",71,36,4,null,5.6,1.6,0.4,0.4,7379,"748","393","402",0.8,14157,"1445","837","772",1.2,20535,"2091","1332","1109",1.6,26712,"2687","1877","1415",92.355000000000004]
["18 0088",80,30.5,2.5,null,5.3,2.8,1.1200000000000001,0.7,3664,"943","91","421",1.4,5911,"1765","303","778",2.1,7211,"2464","637","1070",2.8,8039,"3042","1093","1299",84.305000000000007]
["18 0089",80,31,3,null,5.5,2.5,0.83299999999999996,0.625,4531,"890","212","393",1.25,7847,"1682","520","735",1.875,10352,"2378","926","1025",2.5,12451,"2978","1428","1265",100.598]
["18 0090",80,31,4,null,6.1,2.1,0.52500000000000002,0.52500000000000002,7319,"856","378","366",1.05,13677,"1644","823","695",1.575,19394,"2363","1338","989",2.1,24791,"3014","1920","1246",134.13]
["18 0092",80,35.5,4,null,6.2,2.2000000000000002,0.55000000000000004,0.55000000000000004,8118,"884","364","428",1.1000000000000001,15083,"1693","802","812",1.65,21280,"2428","1314","1154",2.2000000000000002,27093,"3089","1901","1452",126.75]
["18 0094",80,36,3,null,5.7,2.7,0.9,0.67500000000000004,5401,"964","181","487",1.35,9196,"1817","474","909",2.0249999999999999,11919,"2557","879","1265",2.7,14106,"3186","1396","1556",94.400999999999996]
["18 0095",80,41,2.25,null,5.2,2.95,1.3109999999999999,0.73699999999999999,3698,"942","-9","544",1.4750000000000001,5715,"1749","117","1000",2.2120000000000002,6613,"2419","379","1370",2.95,6950,"2953","778","1652",65.459999999999994]
["18 0096",80,41,3,null,5.3,2.2999999999999998,0.76600000000000001,0.57499999999999996,4450,"774","196","434",1.1499999999999999,7838,"1466","474","814",1.7250000000000001,10518,"2074","835","1142",2.2999999999999998,12844,"2600","1278","1417",87.281000000000006]
["18 0097",80,41,4,null,6.2,2.2000000000000002,0.55000000000000004,0.55000000000000004,8726,"883","354","486",1.1000000000000001,16213,"1690","783","924",1.65,22874,"2422","1288","1314",2.2000000000000002,29122,"3078","1868","1655",116.374]
["18 0099",80,41,5,null,6.7,1.7,0.34,0.42499999999999999,11821,"755","439","407",0.85,22928,"1465","924","786",1.2749999999999999,33559,"2130","1453","1135",1.7,43952,"2750","2028","1456",145.46799999999999]
["18 0101",90,46,2.5,null,5.7,3.2,1.28,0.8,4232,"886","2","509",1.6,6585,"1646","130","938",2.4,7684,"2280","385","1286",3.2,8157,"2787","766","1553",92.230999999999995]
["18 0102",90,46,3.5,null,6,2.5,0.71399999999999997,0.625,5836,"756","216","421",1.25,10416,"1434","509","792",1.875,14161,"2035","879","1114",2.5,17487,"2560","1326","1387",129.124]
["18 0103",90,46,5,null,7,2,0.4,0.5,11267,"728","382","394",1,21617,"1406","814","757",1.5,31354,"2035","1295","1088",2,40786,"2615","1826","1387",184.46299999999999]
["18 0105",100,41,4,null,7.2,3.2,0.8,0.8,8715,"944","238","437",1.6,15219,"1788","577","818",2.4,20251,"2530","1017","1144",3.2,24547,"3172","1557","1414",205.15299999999999]
["18 0107",100,41,5,null,7.75,2.75,0.55000000000000004,0.68700000000000006,12345,"896","374","404",1.375,22937,"1717","823","767",2.0619999999999998,32361,"2464","1346","1089",2.75,41201,"3136","1944","1370",256.44099999999997]
["18 0109",100,51,2.7,null,6.2,3.5,1.296,0.875,4779,"853","-3","490",1.75,7410,"1584","116","902",2.625,8609,"2192","357","1235",3.5,9091,"2678","721","1491",123.164]
["18 0110",100,51,3.5,null,6.3,2.8,0.8,0.7,5624,"715","167","399",1.4,9823,"1351","411","749",2.1,13070,"1909","734","1049",2.8,15843,"2389","1136","1298",159.65700000000001]
["18 0111",100,51,4,null,7,3,0.75,0.75,8673,"854","225","476",1.5,15341,"1618","540","894",2.25,20674,"2292","944","1255",3,25338,"2877","1439","1559",182.465]
["18 0113",100,51,5,null,7.8,2.8,0.56000000000000005,0.7,13924,"903","355","496",1.4,25810,"1728","789","942",2.1,36339,"2475","1301","1337",2.8,46189,"3144","1891","1683",228.08099999999999]
["18 0115",100,51,6,null,8.1999999999999993,2.2000000000000002,0.36599999999999999,0.55000000000000004,17061,"763","424","411",1.1000000000000001,32937,"1477","897","790",1.65,48022,"2143","1418","1139",2.2000000000000002,62711,"2760","1987","1457",273.69799999999998]
["18 0117",112,57,3,null,6.9,3.9,1.3,0.97499999999999998,5834,"843","-4","483",1.95,9038,"1565","112","889",2.9249999999999998,10489,"2165","350","1218",3.9,11064,"2645","709","1470",171.917]
["18 0118",112,57,4,null,7.2,3.2,0.8,0.8,7639,"744","173","415",1.6,13341,"1406","428","778",2.4,17752,"1987","765","1090",3.2,21518,"2486","1183","1349",229.22200000000001]
["18 0120",112,57,6,null,8.5,2.5,0.41599999999999998,0.625,15800,"712","363","384",1.25,30215,"1373","777","737",1.875,43707,"1985","1239","1058",2.5,56737,"2548","1752","1348",343.83300000000003]
["18 0122",125,51,4,null,8.5,4.5,1.125,1.125,10096,"980","86","463",2.25,16265,"1832","299","856",3.375,19817,"2556","640","1178",4.5,22060,"3153","1109","1431",321.18200000000002]
["18 0124",125,51,5,null,8.9,3.9,0.78,0.97499999999999998,13063,"913","241","420",1.95,22931,"1730","579","787",2.9249999999999998,30669,"2451","1012","1102",3.9,37342,"3076","1541","1363",401.47800000000001]
["18 0126",125,51,6,null,9.4,3.4,0.56599999999999995,0.85,17027,"859","349","386",1.7,31514,"1645","770","733",2.5499999999999998,44307,"2358","1264","1039",3.4,56254,"2999","1832","1306",481.77300000000002]
["18 0128",125,61,5,null,9,4,0.8,1,14615,"930","220","500",2,25526,"1758","542","938",3,33965,"2485","965","1312",4,41170,"3111","1489","1624",366.95299999999997]
["18 0130",125,61,6,null,9.6,3.6,0.6,0.9,19789,"908","334","481",1.8,36336,"1734","749","911",2.7,50722,"2479","1247","1290",3.6,64028,"3141","1827","1619",440.34300000000002]
["18 0132",125,64,3.5,null,8,4.5,1.2849999999999999,1.125,8514,"907","0","522",2.25,13231,"1684","129","961",3.375,15416,"2331","388","1318",4.5,16335,"2849","777","1591",248.77500000000001]
["18 0133",125,64,5,null,8.5,3.5,0.7,0.875,12238,"778","229","433",1.75,21924,"1477","537","816",2.625,29908,"2099","923","1149",3.5,37041,"2641","1387","1432",355.39299999999997]
["18 0135",125,64,6,null,9.6,3.6,0.6,0.9,20348,"912","331","504",1.8,37362,"1741","746","955",2.7,52155,"2487","1243","1352",3.6,65836,"3150","1823","1697",426.471]
["18 0137",125,71,6,null,9.3000000000000007,3.3,0.55000000000000004,0.82499999999999996,19538,"835","328","504",1.65,36302,"1598","728","959",2.4750000000000001,51217,"2288","1201","1363",3.3,65207,"2905","1746","1718",391.51499999999999]
["18 0139",140,72,3.8,null,8.6999999999999993,4.9000000000000004,1.2889999999999999,1.2250000000000001,9514,"856","-2","495",2.4500000000000002,14773,"1590","119","911",3.6749999999999998,17195,"2201","362","1249",4.9000000000000004,18199,"2690","728","1508",337.73399999999998]
["18 0140",140,72,5,null,9,4,0.8,1,12014,"745","173","419",2,20982,"1408","428","787",3,27920,"1990","764","1101",4,33843,"2490","1182","1363",444.38799999999998]
["18 0142",150,61,5,null,10.3,5.3,1.06,1.325,15292,"976","114","458",2.65,25021,"1829","352","848",3.9750000000000001,31041,"2559","712","1171",5.3,35207,"3165","1196","1426",578.88099999999997]
["18 0144",150,61,6,null,10.8,4.8,0.8,1.2,19560,"946","239","435",2.4,34161,"1791","579","814",3.6,45456,"2535","1020","1138",4.8,55098,"3178","1562","1406",694.65800000000002]
["18 0146",150,71,6,null,10.85,4.8499999999999996,0.80800000000000005,1.212,21067,"943","221","494",2.4249999999999998,36714,"1782","545","926",3.637,48749,"2518","973","1295",4.8499999999999996,58978,"3152","1503","1602",645.82899999999995]
["18 0148",160,82,4.3,null,9.9,5.6,1.302,1.4,12162,"852","-6","491",2.8,18832,"1581","111","904",4.2,21843,"2188","350","1238",5.6,23022,"2672","712","1494",500.40899999999999]
["18 0150",160,82,6,null,10.5,4.5,0.75,1.125,17203,"751","197","420",2.25,30431,"1423","474","790",3.375,41008,"2016","830","1109",4.5,50260,"2530","1264","1377",698.24599999999998]
["18 0152",180,92,4.8,null,11,6.2,1.2909999999999999,1.55,14646,"828","-2","476",3.1,22731,"1537","115","877",4.6500000000000004,26442,"2128","350","1201",6.2,27966,"2600","703","1450",708.33699999999999]
["18 0154",180,92,6,null,11.1,5.0999999999999996,0.85,1.2749999999999999,16558,"705","144","396",2.5499999999999998,28552,"1331","368","742",3.8250000000000002,37502,"1875","672","1035",5.0999999999999996,44930,"2340","1057","1278",885.42100000000005]
["18 0156",200,102,5.5,null,12.5,7,1.272,1.75,19817,"861","5","494",3.5,30882,"1599","131","910",5.25,36111,"2216","381","1247",7,38423,"2709","752","1507",1004]
["19 0001",100,51,7,6.55,9.1999999999999993,2.2000000000000002,0.314,0.55000000000000004,27374,"950","457","516",1.1000000000000001,52454,"1843","972","996",1.65,75840,"2679","1543","1439",2.65,115982,"4053","2729","2152",298.78699999999998]
["19 0002",125,61,8,7.5,10.9,2.9,0.36199999999999999,0.72499999999999998,34434,"937","415","492",1.45,65305,"1812","893","945",2.1749999999999998,93577,"2625","1432","1359",3.4,138144,"3856","2486","1972",550.42899999999997]
["19 0003",125,64,7,6.55,10,3,0.42799999999999999,0.75,25528,"886","335","489",1.5,47615,"1706","738","935",2.25,67216,"2458","1208","1338",3.45,95795,"3521","2099","1893",465.56400000000002]
["19 0004",125,64,8,7.5,10.6,2.6,0.32500000000000001,0.65,31118,"825","391","450",1.3,59520,"1599","833","867",1.95,85926,"2322","1326","1252",3.1,129972,"3477","2322","1854",533.03899999999999]
["19 0005",125,71,8,7.45,10.9,2.9,0.36199999999999999,0.72499999999999998,38416,"974","408","587",1.45,72705,"1882","883","1128",2.1749999999999998,103964,"2723","1424","1623",3.45,154927,"4042","2537","2384",486.13099999999997]
["19 0006",125,71,10,9.3000000000000007,11.8,1.8,0.18,0.45,42821,"674","409","398",0.9,84082,"1322","845","779",1.35,124124,"1943","1306","1141",2.5,223282,"3413","2605","1986",606.84799999999996]
["19 0007",140,72,8,7.5,11.2,3.2,0.4,0.8,31903,"846","343","467",1.6,59967,"1631","747","895",2.4,85251,"2355","1213","1284",3.7,123137,"3402","2098","1832",666.58100000000002]
["19 0008",150,61,7,6.55,11.8,4.8,0.68500000000000005,1.2,30593,"1135","245","525",2.4,53294,"2156","604","986",3.6,70442,"3062","1079","1385",5.25,89248,"4119","1919","1830",758.33500000000004]
["19 0009",150,71,8,7.5,12.05,4.05,0.50600000000000001,1.012,35885,"983","321","510",2.0249999999999999,65655,"1884","725","969",3.0369999999999999,91060,"2702","1212","1378",4.55,124679,"3769","2094","1895",807.23699999999997]
["19 0010",150,81,8,7.5,12,4,0.5,1,38230,"982","315","572",2,70060,"1881","713","1088",3,97319,"2697","1195","1549",4.5,133637,"3764","2074","2136",737]
["19 0011",150,81,10,9.4,13.4,3.4,0.34,0.85,57601,"950","438","544",1.7,109889,"1839","938","1049",2.5499999999999998,158300,"2668","1498","1512",4,236018,"3941","2593","2211",923.71]
["19 0012",160,82,10,9.4,13.5,3.5,0.35,0.875,50547,"857","390","469",1.75,96216,"1658","836","902",2.625,138331,"2403","1338","1299",4.0999999999999996,204958,"3533","2310","1889",1094]
["19 0013",160,82,11,10.199999999999999,14.5,3.5,0.318,0.875,66678,"943","434","515",1.75,127338,"1827","925","994",2.625,183518,"2655","1474","1436",4.3,284160,"4078","2686","2179",1187]
["19 0014",180,92,10,9.4,14,4,0.4,1,46850,"796","327","437",2,88141,"1535","712","837",3,125417,"2217","1153","1201",4.5999999999999996,180562,"3188","1979","1707",1387]
["19 0015",180,92,13,12.1,16.5,3.5,0.26900000000000002,0.875,84574,"849","438","460",1.75,163392,"1653","922","892",2.625,237883,"2412","1452","1294",4.4000000000000004,381593,"3811","2664","2021",1786]
["19 0016",200,82,8,7.5,14.2,6.2,0.77500000000000002,1.55,35519,"977","162","458",3.1,60470,"1847","431","857",4.6500000000000004,78034,"2611","806","1198",6.7,95329,"3458","1466","1558",1539]
["19 0017",200,82,10,9.4,15.5,5.5,0.55000000000000004,1.375,52053,"973","303","446",2.75,94245,"1862","691","846",4.125,129445,"2665","1164","1198",6.1,173523,"3669","1993","1622",1928]
["19 0018",200,82,12,11.25,16.600000000000001,4.5999999999999996,0.38300000000000001,1.1499999999999999,67868,"898","393","404",2.2999999999999998,128082,"1735","847","774",3.45,182737,"2512","1361","1111",5.35,266449,"3662","2345","1594",2308]
["19 0019",200,92,10,9.4,15.6,5.6,0.56000000000000005,1.4,55657,"980","289","498",2.8,100501,"1873","665","943",4.2,137688,"2677","1130","1336",6.2,183777,"3673","1946","1806",1828]
["19 0020",200,92,12,11.25,16.8,4.8,0.4,1.2,74572,"930","385","465",2.4,140170,"1794","836","890",3.6,199269,"2591","1354","1276",5.55,287825,"3747","2335","1819",2187]
["19 0021",200,92,14,13.05,18.100000000000001,4.0999999999999996,0.29199999999999998,1.0249999999999999,95817,"877","441","433",2.0499999999999998,184267,"1706","931","837",3.0750000000000002,267227,"2485","1471","1211",5.05,418519,"3846","2649","1850",2537]
["19 0022",200,102,8,7.5,13.6,5.6,0.7,1.4,33367,"845","160","475",2.8,57955,"1601","409","892",4.2,76378,"2268","747","1254",6.1,96202,"3031","1347","1654",1368]
["19 0023",200,102,10,9.4,15.6,5.6,0.56000000000000005,1.4,58756,"983","281","546",2.8,106099,"1877","651","1036",4.2,145357,"2682","1111","1468",6.2,194014,"3676","1923","1987",1716]
["19 0024",200,102,12,11.25,16.2,4.2,0.35,1.05,66983,"792","357","432",2.1,127401,"1532","766","831",3.15,183020,"2221","1227","1196",4.95,272297,"3282","2136","1747",2053]
["19 0025",200,102,14,13.05,18.2,4.2,0.3,1.05,103986,"904","441","491",2.1,199671,"1755","935","948",3.15,289181,"2554","1481","1371",5.15,450249,"3931","2667","2085",2381]
["19 0026",200,112,12,11.25,16.2,4.2,0.35,1.05,71671,"809","359","480",2.1,136317,"1564","772","923",3.15,195830,"2266","1238","1330",4.95,291355,"3345","2160","1944",1904]
["19 0027",200,112,14,13.05,17.5,3.5,0.25,0.875,90576,"745","397","438",1.75,175719,"1452","832","850",2.625,256758,"2121","1306","1236",4.45,418407,"3394","2414","1959",2209]
["19 0028",200,112,16,14.8,19.8,3.8,0.23699999999999999,0.95,146464,"927","493","545",1.9,284370,"1808","1032","1059",2.85,415725,"2644","1616","1542",5,699348,"4368","3106","2521",2505]
["19 0029",225,112,6.5,6.2,13.6,7.1,1.0920000000000001,1.7749999999999999,23582,"794","15","446",3.55,37417,"1482","136","825",5.3250000000000002,44580,"2063","364","1137",7.4,48614,"2608","764","1418",1455]
["19 0030",225,112,8,7.5,14.5,6.5,0.81200000000000006,1.625,32870,"812","104","450",3.25,55412,"1531","301","842",4.875,70749,"2158","591","1176",7,85127,"2836","1110","1524",1761]
["19 0031",225,112,12,11.25,17,5,0.41599999999999998,1.25,64497,"772","304","415",2.5,120738,"1488","666","794",3.75,171016,"2146","1084","1137",5.75,244783,"3080","1872","1612",2641]
["19 0032",225,112,16,14.9,20.5,4.5,0.28100000000000003,1.125,128407,"864","438","458",2.25,247489,"1680","923","886",3.375,359590,"2449","1456","1283",5.6,569897,"3829","2651","1983",3498]
["19 0033",250,102,10,9.4,18,8,0.8,2,58157,"1017","160","476",4,98485,"1922","432","889",6,126387,"2713","817","1241",8.6,152967,"3574","1487","1605",3019]
["19 0034",250,102,12,11.25,19,7,0.58299999999999996,1.75,75052,"971","276","445",3.5,134524,"1854","640","842",5.25,182962,"2648","1093","1190",7.75,242024,"3630","1894","1603",3613]
["19 0035",250,127,7,6.7,14.8,7.8,1.1140000000000001,1.95,26895,"767","10","438",3.9,42527,"1430","123","810",5.85,50466,"1989","340","1116",8.1,54733,"2506","718","1388",1915]
["19 0036",250,127,8,7.5,16,8,1,2,38439,"877","30","500",4,61836,"1641","173","928",6,74819,"2292","429","1284",8.5,83455,"2947","908","1628",2144]
["19 0037",250,127,10,9.4,17,7,0.7,1.75,51871,"842","163","471",3.5,90206,"1595","415","886",5.25,119053,"2260","755","1244",7.6,149964,"3014","1350","1638",2687]
["19 0038",250,127,12,11.25,19.3,7.3,0.60799999999999998,1.825,87633,"1011","251","563",3.65,156021,"1926","599","1063",5.4749999999999996,210806,"2743","1045","1502",8.0500000000000007,275879,"3730","1839","2016",3216]
["19 0039",250,127,14,13.1,19.600000000000001,5.6,0.4,1.4,93239,"813","328","444",2.8,175145,"1568","715","851",4.2,248828,"2264","1160","1221",6.5,360229,"3281","2018","1748",3745]
["19 0040",250,127,16,14.9,21.8,5.8,0.36199999999999999,1.45,141529,"949","406","517",2.9,267853,"1833","875","993",4.3499999999999996,383017,"2655","1408","1428",6.9,570770,"3944","2500","2096",4260]

{"sheet":"Extra","index":2,"n_rows":155,"n_cols":29,"rows_kept":155,"cut":false,"hidden":false,"merged":[[0,8,0,12],[0,13,0,17],[0,18,0,22],[0,23,0,27],[0,3,0,5]]}
[{"$f":"Programm!BN88","v":"Bestell-"},{"$f":"Programm!BN85","v":"kopieren"},null,{"$f":"Programm!BN87","v":"Sonderabmessungen"},null,null,null,null,"s = 0,25 h0",null,null,null,null,"s = 0,50 h0",null,null,null,null,"s = 0,75 h0",null,null,null,null,"s = 1,00 h0",null,null,null,null,{"$f":"Programm!BN90","v":"Masse 1000 Stück"}]
[{"$f":"Programm!BN89","v":"Nr.:"},"De","Di","t","t'","l0","h0","h0/t","s","F","s1","s2","s3","s","F","s1","s2","s3","s","F","s1","s2","s3","s","F","s1","s2","s3","in kg"]
["18 0079",70,35.5,4,3.75,5.8,1.8,0.45,0.45,9167,977,357,535,0.9,17018,1877,790,1022,1.35,23923,2701,1299,1460,2.0499999999999998,33656,3831,2244,2045,84.149000000000001]
["18 0081",70,40.5,4,3.75,5.7,1.7,0.42499999999999999,0.42499999999999999,9423,942,354,579,0.85,17604,1813,779,1108,1.2749999999999999,24889,2611,1277,1588,1.95,35467,3731,2215,2246,75.364000000000004]
["18 0083",70,40.5,5,4.7,6.4,1.4,0.28000000000000003,0.35,14004,886,457,537,0.7,27059,1722,963,1040,1.05,39410,2509,1518,1509,1.7,61324,3841,2680,2289,94.456000000000003]
["18 0087",71,36,4,3.75,5.6,1.6,0.4,0.4,7685,821,334,447,0.8,14445,1583,727,857,1.2,20535,2286,1179,1230,1.85,29661,3302,2039,1755,86.581999999999994]
["18 0091",80,31,4,3.75,6.1,2.1,0.52500000000000002,0.52500000000000002,7717,933,308,406,1.05,14049,1788,694,771,1.575,19394,2564,1159,1094,2.35,26327,3566,1989,1495,125.747]
["18 0093",80,35.5,4,3.75,6.2,2.2000000000000002,0.55000000000000004,0.55000000000000004,8577,964,289,474,1.1000000000000001,15512,1843,664,899,1.65,21280,2637,1124,1274,2.4500000000000002,28564,3638,1945,1731,118.828]
["18 0098",80,41,4,3.75,6.2,2.2000000000000002,0.55000000000000004,0.55000000000000004,9220,965,278,538,1.1000000000000001,16674,1843,642,1021,1.65,22874,2634,1094,1448,2.4500000000000002,30703,3630,1906,1970,109.1]
["18 0100",80,41,5,4.7,6.7,1.7,0.34,0.42499999999999999,12211,827,385,452,0.85,23296,1602,822,871,1.2749999999999999,33559,2324,1312,1255,2,50035,3434,2269,1834,136.74]
["18 0104",90,46,5,4.7,7,2,0.4,0.5,11713,796,327,437,1,22035,1535,712,837,1.5,31354,2217,1153,1201,2.2999999999999998,45141,3188,1979,1707,173.39500000000001]
["18 0106",100,41,4,3.8,7.2,3.2,0.8,0.8,9215,1004,173,470,1.6,15683,1898,457,880,2.4,20251,2681,851,1228,3.4,24574,3503,1501,1577,194.89599999999999]
["18 0108",100,41,5,4.7,7.75,2.75,0.55000000000000004,0.68700000000000006,13013,973,303,446,1.375,23561,1862,691,846,2.0619999999999998,32361,2665,1164,1198,3.05,43381,3669,1933,1622,241.05500000000001]
["18 0112",100,51,4,3.8,7,3,0.75,0.75,9156,912,165,513,1.5,15789,1724,429,962,2.25,20674,2437,792,1348,3.2,25555,3198,1394,1747,173.34200000000001]
["18 0114",100,51,5,4.7,7.8,2.8,0.56000000000000005,0.7,14689,983,281,546,1.4,26525,1877,651,1036,2.1,36339,2682,1111,1468,3.1,48503,3676,1923,1987,214.39699999999999]
["18 0116",100,51,6,5.6,8.1999999999999993,2.2000000000000002,0.36599999999999999,0.55000000000000004,17753,843,361,461,1.1000000000000001,33589,1629,778,885,1.65,48022,2358,1253,1273,2.6,71153,3483,2207,1858,255.45099999999999]
["18 0119",112,57,4,3.75,7.2,3.2,0.8,0.8,8192,805,107,454,1.6,13855,1518,305,850,2.4,17752,2139,595,1188,3.45,21468,2816,1114,1542,214.89599999999999]
["18 0121",112,57,6,5.6,8.5,2.5,0.41599999999999998,0.625,16536,786,302,431,1.25,30906,1513,662,824,1.875,43707,2182,1081,1181,2.9,62863,3152,1894,1685,320.911]
["18 0123",125,51,4,3.8,8.5,4.5,1.125,1.125,10705,1031,19,492,2.25,16830,1924,176,908,3.375,19817,2680,471,1249,4.7,21268,3394,994,1554,305.12299999999999]
["18 0125",125,51,5,4.75,8.9,3.9,0.78,0.97499999999999998,13804,972,179,452,1.95,23619,1838,463,847,2.9249999999999998,30669,2599,852,1183,4.1500000000000004,37492,3405,1492,1524,381.404]
["18 0127",125,51,6,5.65,9.4,3.4,0.56599999999999995,0.85,17944,931,282,426,1.7,32369,1779,647,806,2.5499999999999998,44307,2544,1095,1140,3.75,58923,3482,1868,1535,453.7]
["18 0129",125,61,5,4.75,9,4,0.8,1,15455,990,155,538,2,26305,1869,421,1007,3,33965,2637,799,1407,4.25,41217,3439,1428,1811,348.60500000000002]
["18 0131",125,61,6,5.6,9.6,3.6,0.6,0.9,21079,996,249,535,1.8,37539,1897,592,1011,2.7,50722,2703,1031,1429,4,66696,3701,1831,1929,410.98700000000002]
["18 0134",125,64,5,4.7,8.5,3.5,0.7,0.875,13031,842,163,475,1.75,22661,1596,415,893,2.625,29908,2262,754,1254,3.8,37673,3017,1350,1651,334.06900000000002]
["18 0136",125,64,6,5.6,9.6,3.6,0.6,0.9,21674,1000,246,560,1.8,38599,1905,587,1059,2.7,52155,2714,1024,1497,4,68579,3713,1825,2022,398.04]
["18 0138",125,71,6,5.6,9.3000000000000007,3.3,0.55000000000000004,0.82499999999999996,20725,919,250,561,1.65,37411,1754,583,1065,2.4750000000000001,51217,2504,1001,1511,3.7,68887,3464,1776,2067,365.41399999999999]
["18 0141",140,72,5,4.7,9,4,0.8,1,12847,803,109,457,2,21756,1516,310,856,3,27920,2136,601,1196,4.3,33792,2807,1117,1551,417.72399999999999]
["18 0143",150,61,5,4.75,10.3,5.3,1.06,1.325,16221,1029,48,488,2.65,25883,1925,228,903,3.9750000000000001,31041,2688,542,1245,5.55,34160,3422,1088,1557,549.93700000000001]
["18 0145",150,61,6,5.7,10.8,4.8,0.8,1.2,20684,1006,174,463,2.4,35204,1901,459,875,3.6,45456,2686,855,1221,5.0999999999999996,55161,3510,1506,1569,659.92499999999995]
["18 0147",150,71,6,5.6,10.85,4.8499999999999996,0.80800000000000005,1.212,22703,1023,131,544,2.4249999999999998,38235,1930,379,1017,3.637,48749,2721,743,1420,5.25,58662,3591,1408,1846,602.774]
["18 0149",160,82,4.3,4.1500000000000004,9.9,5.6,1.302,1.4,12653,880,-45,510,2.8,19288,1632,38,938,4.2,21843,2256,250,1284,5.75,22250,2797,634,1572,482.95299999999997]
["18 0151",160,82,6,5.6,10.5,4.5,0.75,1.125,18496,818,125,464,2.25,31633,1547,341,870,3.375,41008,2186,646,1218,4.9000000000000004,50562,2908,1203,1599,651.69600000000003]
["18 0153",180,92,4.8,4.5999999999999996,11,6.2,1.2909999999999999,1.55,15352,861,-48,498,3.1,23387,1597,30,916,4.6500000000000004,26442,2208,233,1255,6.4,26839,2747,612,1540,678.822]
["18 0155",180,92,6,5.6,11.1,5.0999999999999996,0.85,1.2749999999999999,17866,765,76,435,2.5499999999999998,29767,1440,243,812,3.8250000000000002,37502,2024,499,1132,5.5,44355,2654,974,1464,826.39300000000003]
["18 0157",200,102,5.5,5.3,12.5,7,1.272,1.75,20659,892,-37,514,3.5,31663,1655,54,946,5.25,36111,2289,274,1296,7.2,37138,2845,671,1590,967.06600000000003]
["18 0173",200,82,5,4.8,10.5,5.5,1.1000000000000001,1.375,9700,600,26,290,2.75,15400,1130,130,530,4.125,18400,1570,310,730,5.7,20100,1980,620,910,980]
["18 0174",200,82,6,5.8,13,7,1.167,1.75,22300,940,22,450,3.5,35000,1750,170,830,5.25,41200,2440,450,1140,7.2,44200,3050,900,1400,1190]
["18 0175",200,112,6,5.8,12,6,1,1.5,19700,770,50,470,3,32200,1430,200,880,4.5,39700,2000,450,1210,6.2,45100,2530,850,1520,980]
["19 0041",200,82,8.5,8.1,14.5,6,0.70599999999999996,1.5,38500,960,220,440,3,67200,1810,540,830,4.5,89300,2580,960,1170,6.4,112100,3400,1620,1520,1660]
["19 0042",200,82,13,12.1,16.5,3.5,0.26900000000000002,0.875,62100,700,370,310,1.75,120000,1360,780,600,2.625,174800,1990,1220,870,4.4000000000000004,280300,3150,2240,1360,2480]
["19 0043",200,102,8.3000000000000007,7.8,14.3,6,0.72299999999999998,1.5,40500,950,170,530,3,70000,1790,440,1000,4.5,91800,2530,810,1400,6.5,114600,3370,1470,1840,1420]
["19 0044",200,102,9,8.6,14.6,5.6,0.622,1.4,44100,890,240,500,2.8,78800,1700,570,940,4.2,107100,2420,980,1330,6,138600,3220,1640,1750,1570]
["19 0045",200,102,11,10.3,15,4,0.36399999999999999,1,49500,700,300,380,2,93900,1350,660,730,3,134500,1950,1050,1050,4.7,198700,2870,1840,1530,1880]
["19 0046",200,112,15,14,18,3,0.2,0.75,93500,660,390,390,1.5,183100,1290,810,750,2.25,269700,1900,1260,1100,4,465200,3200,2400,1840,2370]
["19 0047",225,112,9,8.4499999999999993,15.5,6.5,0.72199999999999998,1.625,43600,880,160,480,3.25,75300,1660,410,910,4.875,98800,2350,760,1270,7.05,123300,3130,1370,1670,1980]
["19 0048",225,112,10,9.4,16.2,6.2,0.62,1.55,52800,880,220,480,3.1,93900,1680,520,910,4.6500000000000004,126700,2400,910,1290,6.8,164800,3240,1590,1720,2200]
["19 0049",225,112,10.8,10,16.5,5.7,0.52800000000000002,1.425,58100,850,240,470,2.85,105200,1630,560,880,4.2750000000000004,144400,2340,960,1250,6.5,197000,3290,1720,1740,2350]
["19 0050",250,127,7.5,7,16.5,9,1.2,2.25,41900,1000,53,580,4.5,64400,1860,40,1060,6.75,73500,2580,270,1460,9.5,75100,3260,740,1820,2000]
["19 0051",250,127,9,8.4499999999999993,16.600000000000001,7.6,0.84399999999999997,1.9,45900,880,98,500,3.8,76800,1650,300,930,5.7,97300,2330,600,1290,8.15,115600,3040,1150,1670,2420]
["19 0052",250,127,9.1999999999999993,8.6,17.399999999999999,8.1999999999999993,0.89100000000000001,2.0499999999999998,55200,990,80,560,4.0999999999999996,91000,1860,280,1050,6.15,113400,2620,600,1460,8.8000000000000007,132000,3410,1200,1870,2460]
["19 0053",250,127,10.5,9.9,18,7.5,0.71399999999999997,1.875,64800,950,180,530,3.75,112500,1800,460,1000,5.625,148100,2550,840,1400,8.1,185500,3380,1500,1840,2830]
["19 0054",250,127,11,10.4,18.8,7.8,0.70899999999999996,1.95,77000,1030,200,580,3.9,133900,1950,520,1080,5.85,176900,2760,940,1520,8.4,222000,3660,1650,1990,2970]
["19 0055",250,127,13,12.2,19.600000000000001,6.6,0.50800000000000001,1.65,93900,940,300,520,3.3,171800,1800,680,990,4.95,238300,2580,1150,1400,7.4,325800,3590,1980,1930,3490]
["19 0056",250,127,13.5,12.6,19.600000000000001,6.1,0.45200000000000001,1.5249999999999999,94200,880,310,480,3.05,174400,1700,700,930,4.5750000000000002,244700,2440,1150,1320,7,345300,3480,2010,1860,3600]
["19 0057",250,127,14.5,13.6,20,5.5,0.379,1.375,100400,820,350,440,2.75,189700,1570,750,850,4.125,270800,2280,1210,1220,6.4,395600,3310,2090,1760,3890]
["19 0058",250,127,15,14.1,21,6,0.4,1.5,122500,930,380,510,3,230500,1790,830,970,4.5,327900,2580,1350,1390,6.9,472100,3720,2310,1980,4030]
["19 0059",250,127,16.8,15.65,22,5.2,0.31,1.3,142800,870,410,470,2.6,273500,1680,880,900,3.9,395400,2440,1390,1310,6.35,611600,3740,2510,1980,4470]
["19 0060",250,127,17.5,16.350000000000001,22,4.5,0.25700000000000001,1.125,136000,750,400,400,2.25,263600,1460,850,780,3.375,384900,2140,1330,1140,5.65,619500,3390,2410,1780,4670]
["19 0061",250,127,18.5,17.3,23,4.5,0.24299999999999999,1.125,159700,790,440,420,2.25,310400,1530,910,820,3.375,454300,2240,1420,1190,5.7,739800,3590,2600,1890,4950]
["19 0062",270,127,10.65,10,18,7.35,0.69,1.8380000000000001,53800,800,160,420,3.6749999999999998,93700,1520,410,790,5.5129999999999999,123900,2150,740,1110,8,156700,2880,1320,1460,3500]
["19 0063",270,142,22,null,26.9,4.9000000000000004,0.223,1.2250000000000001,248700,780,550,430,2.4500000000000002,490700,1530,1130,830,3.6749999999999998,728300,2250,1750,1210,4.9000000000000004,963500,2930,2400,1580,7150]
["19 0064",280,127,12,11.4,21.4,9.4,0.78300000000000003,2.35,95400,1110,190,560,4.7,163100,2090,500,1060,7.05,211600,2950,940,1480,10,258300,3860,1650,1900,4380]
["19 0065",280,127,19,18,25,6,0.316,1.5,178200,880,450,430,3,342600,1710,950,830,4.5,496800,2490,1510,1200,7,741600,3670,2550,1740,6910]
["19 0066",280,142,12,11.3,21,9,0.75,2.25,95100,1060,180,590,4.5,163400,2000,470,1110,6.75,212900,2820,880,1560,9.6999999999999993,262900,3730,1590,2030,4060]
["19 0067",280,142,15,14.1,21.4,6.4,0.42699999999999999,1.6,105700,800,310,440,3.2,197600,1540,680,840,4.8,279500,2220,1120,1200,7.3,396800,3160,1910,1690,5060]
["19 0068",280,142,16.600000000000001,15.6,23.25,6.65,0.40100000000000002,1.663,146600,910,370,490,3.3250000000000002,275800,1750,810,950,4.9880000000000004,392300,2530,1310,1360,7.65,564800,3640,2260,1930,5600]
["19 0069",280,142,17.45,16.399999999999999,23.9,6.45,0.37,1.613,162300,910,400,490,3.2250000000000001,307600,1760,860,950,4.8380000000000001,440400,2540,1380,1360,7.5,645100,3700,2380,1960,5890]
["19 0070",280,142,18,16.899999999999999,24,6,0.33300000000000002,1.5,162600,860,400,460,3,310600,1660,860,890,4.5,447900,2400,1370,1290,7.1,672000,3570,2370,1890,6070]
["19 0071",280,142,18.899999999999999,17.8,24.6,5.7,0.30199999999999999,1.425,175800,830,420,450,2.85,338300,1620,890,870,4.2750000000000004,491000,2350,1410,1250,6.8,748700,3540,2450,1870,6390]
["19 0072",280,142,20.3,19.100000000000001,25.4,5.0999999999999996,0.251,1.2749999999999999,190600,780,430,420,2.5499999999999998,370300,1510,903,810,3.8250000000000002,542100,2210,1410,1170,6.3,862700,3460,2510,1820,6860]
["19 0073",280,142,22,20.65,26.35,4.3499999999999996,0.19800000000000001,1.0880000000000001,202800,700,430,370,2.1749999999999998,397600,1360,880,720,3.2629999999999999,586300,2000,1360,1060,5.7,996900,3330,2550,1740,7410]
["19 0074",280,152,12.8,11.9,19.8,7,0.54700000000000004,1.75,82100,820,220,480,3.5,148000,1560,520,910,5.25,202500,2230,890,1290,7.9,273200,3110,1590,1780,4060]
["19 0075",280,152,15,14,21.4,6.4,0.42699999999999999,1.6,111300,820,300,480,3.2,207500,1580,670,910,4.8,292700,2270,1100,1300,7.4,418700,3260,1930,1850,4770]
["19 0076",280,152,18.5,17.399999999999999,23.6,5.0999999999999996,0.27600000000000002,1.2749999999999999,152700,730,380,420,2.5499999999999998,295400,1420,800,810,3.8250000000000002,430600,2060,1270,1170,6.2,671500,3170,2230,1780,5930]
["19 0077",300,127,12,11.3,21,9,0.75,2.25,76300,930,170,440,4.5,131000,1750,440,830,6.75,170700,2480,810,1170,9.6999999999999993,210800,3280,1440,1520,5150]
["19 0078",300,127,13,12.3,20.5,7.5,0.57699999999999996,1.875,70900,770,230,360,3.75,127800,1460,530,680,5.625,174900,2090,900,970,8.1999999999999993,231100,2840,1520,1290,5600]
["19 0079",300,127,14,13.3,21,7,0.5,1.75,78300,740,270,340,3.5,144200,1410,600,660,5.25,201400,2030,980,930,7.7,273700,2790,1630,1260,6060]
["19 0080",300,127,15.3,null,22.8,7.5,0.49,1.875,104600,800,370,370,3.75,197000,1540,800,700,5.625,281200,2210,1290,1000,7.5,361400,2830,1840,1270,6970]
["19 0081",300,127,16,15.2,24.3,8.3000000000000007,0.51900000000000002,2.0750000000000002,140200,1010,350,470,4.1500000000000004,257000,1930,790,900,6.2249999999999996,357400,2770,1310,1270,9.1,482200,3790,2170,1720,6920]
["19 0082",300,127,17,16.100000000000001,23.8,6.8,0.4,1.7,128400,830,360,380,3.4,242200,1600,780,730,5.0999999999999996,345500,2310,1260,1050,7.7,492600,3280,2100,1470,7330]
["19 0083",300,127,17.399999999999999,16.45,22.65,5.25,0.30199999999999999,1.3129999999999999,101100,620,320,280,2.625,194800,1200,690,550,3.9380000000000002,283000,1750,1080,790,6.2,428200,2620,1840,1160,7490]
["19 0084",300,152,8.5,8.25,16.8,8.3000000000000007,0.97599999999999998,2.0750000000000002,31300,640,60,360,4.1500000000000004,51500,1200,200,670,6.2249999999999996,64100,1680,420,930,8.5500000000000007,73700,2130,760,1160,3400]
["19 0085",300,152,10,9.4,20,10,1,2.5,64900,950,40,540,5,104500,1780,190,1000,7.5,126600,2480,470,1390,10.6,141500,3180,990,1750,3880]
["19 0086",300,152,12,11.3,21,9,0.75,2.25,82800,920,150,520,4.5,142200,1740,410,970,6.75,185300,2460,760,1350,9.6999999999999993,228900,3250,1380,1770,4660]
["19 0087",300,152,13,12.2,22,9,0.69199999999999995,2.25,101200,970,190,540,4.5,176200,1850,480,1020,6.75,232800,2620,880,1440,9.8000000000000007,294200,3500,1580,1900,5030]
["19 0088",300,152,14,13.2,22,8,0.57099999999999995,2,102500,880,250,480,4,184700,1670,580,920,6,252700,2380,980,1300,8.8000000000000007,335200,3250,1690,1750,5440]
["19 0089",300,152,14.5,13.6,22,7.5,0.51700000000000002,1.875,103400,830,260,460,3.75,188600,1590,590,870,5.625,260900,2280,1000,1240,8.4,355300,3170,1730,1700,5610]
["19 0090",300,152,15,14.1,23,8,0.53300000000000003,2,123100,920,280,510,4,223900,1770,650,970,6,308900,2530,1090,1370,8.9,417100,3490,1880,1870,5820]
["19 0091",300,152,15.5,14.6,23.5,8,0.51600000000000001,2,134100,940,300,520,4,245200,1800,690,990,6,339900,2590,1150,1400,8.9,461800,3570,1970,1910,6020]
["19 0092",300,152,16.100000000000001,15.1,23.7,7.6,0.47199999999999998,1.9,139200,910,320,500,3.8,257000,1750,710,960,5.7,359500,2520,1180,1360,8.6,500100,3550,2030,1890,6230]
["19 0093",300,152,16.5,null,23,6.5,0.39400000000000002,1.625,117500,700,370,380,3.25,225600,1350,790,720,4.875,327600,1960,1260,1040,6.5,426400,2520,1770,1320,6810]
["19 0094",300,152,17,16,24.4,7.4,0.435,1.85,155600,920,350,500,3.7,290300,1760,770,960,5.55,410000,2540,1270,1370,8.4,578800,3600,2160,1920,6600]
["19 0095",300,152,18,16.8,25,7,0.38900000000000001,1.75,170900,910,370,490,3.5,321700,1750,800,950,5.25,457700,2520,1300,1360,8.1999999999999993,669000,3690,2280,1960,6930]
["19 0096",300,152,18.5,17.399999999999999,25,6.5,0.35099999999999998,1.625,167900,840,380,450,3.25,319600,1620,820,870,4.875,459500,2350,1300,1250,7.6,679600,3440,2250,1820,7180]
["19 0097",300,152,19.5,18.3,26.2,6.7,0.34399999999999997,1.675,202200,910,420,490,3.35,385200,1760,890,950,5.0250000000000004,554200,2550,1420,1360,7.9,826600,3770,2480,1990,7550]
["19 0098",300,152,20,18.8,25.5,5.5,0.27500000000000002,1.375,173000,730,390,390,2.75,334500,1420,810,760,4.125,487600,2070,1280,1100,6.7,761900,3190,2260,1680,7750]
["19 0099",300,152,20.5,19.3,26.5,6,0.29299999999999998,1.5,204700,820,420,440,3,394700,1600,900,860,4.5,573800,2330,1410,1240,7.2,881200,3530,2460,1860,7960]
["19 0100",300,182,12,11.1,18,6,0.5,1.5,54400,590,170,380,3,99100,1130,390,730,4.5,136900,1620,660,1030,6.9,189600,2290,1210,1450,3890]
["19 0101",320,172,8.1,7.6,16.3,8.1999999999999993,1.012,2.0499999999999998,26200,560,10,340,4.0999999999999996,42000,1050,100,630,6.15,50600,1470,260,870,8.6999999999999993,56200,1890,570,1100,3410]
["19 0102",320,172,9,8.5,19,10,1.111,2.5,47000,790,10,470,5,73900,1470,90,880,7.5,87100,2050,302,1210,10.5,93500,2590,690,1510,3820]
["19 0103",320,172,13,12.2,20,7,0.53800000000000003,1.75,64400,620,180,360,3.5,117000,1190,420,690,5.25,161000,1710,720,980,7.8,217100,2360,1250,1330,5480]
["19 0104",320,172,15,14.1,21,6,0.4,1.5,77600,570,230,330,3,146100,1100,510,630,4.5,207900,1590,820,900,6.9,299300,2290,1410,1280,6330]
["19 0105",340,172,9.1999999999999993,8.65,19.399999999999999,10.199999999999999,1.109,2.5499999999999998,43700,720,10,410,5.0999999999999996,68600,1350,90,760,7.65,80700,1870,280,1050,10.75,86300,2380,640,1320,4590]
["19 0106",340,172,9.5,8.9,20.8,11.3,1.1890000000000001,2.8250000000000002,57000,850,40,490,5.65,87900,1590,50,900,8.4749999999999996,100800,2200,250,1240,11.9,104000,2790,650,1550,4720]
["19 0107",340,172,10.5,9.9,22.5,12,1.143,3,78300,980,20,560,6,122200,1830,100,1030,9,142500,2540,350,1420,12.6,150800,3210,830,1780,5250]
["19 0108",340,172,11,10.4,22.4,11.4,1.036,2.85,78300,930,30,530,5.7,125400,1750,180,980,8.5500000000000007,151000,2440,450,1360,12,167000,3110,940,1710,5520]
["19 0109",340,172,11.5,10.8,22.9,11.4,0.99099999999999999,2.85,87000,970,40,550,5.7,140300,1810,200,1020,8.5500000000000007,170400,2530,490,1410,12.1,191000,3250,1020,1790,5730]
["19 0110",340,172,12.5,11.8,23,10.5,0.84,2.625,90800,900,110,510,5.25,152500,1700,330,950,7.875,194000,2390,650,1320,11.2,231400,3120,1200,1700,6260]
["19 0111",340,172,13.5,12.7,23.5,10,0.74099999999999999,2.5,101300,890,150,500,5,174300,1690,400,940,7.5,227600,2390,750,1310,10.8,282100,3160,1360,1720,6740]
["19 0112",340,172,13.7,12.9,24.3,10.6,0.77400000000000002,2.65,115000,970,150,550,5.3,196200,1840,410,1020,7.95,253900,2600,780,1430,11.4,310700,3420,1420,1860,6840]
["19 0113",340,172,14.2,13.3,24.4,10.199999999999999,0.71799999999999997,2.5499999999999998,118800,950,170,530,5.0999999999999996,205200,1800,440,1000,7.65,268900,2550,810,1400,11.1,336100,3410,1480,1850,7050]
["19 0114",340,172,14.6,13.7,25.1,10.5,0.71899999999999997,2.625,132700,1010,180,560,5.25,229400,1910,470,1060,7.875,300900,2700,870,1480,11.4,376100,3590,1570,1950,7270]
["19 0115",340,172,15.3,14.4,24.7,9.4,0.61399999999999999,2.35,126200,900,220,500,4.7,224700,1700,540,940,7.05,303700,2430,930,1320,10.3,396100,3290,1630,1770,7640]
["19 0116",340,172,15.8,14.8,25.5,9.6999999999999993,0.61399999999999999,2.4249999999999998,144000,960,230,530,4.8499999999999996,255900,1830,560,1010,7.2750000000000004,345200,2600,980,1420,10.7,450700,3540,1730,1910,7850]
["19 0117",340,172,16.2,15.2,25.6,9.4,0.57999999999999996,2.35,146700,940,250,520,4.7,263200,1790,590,980,7.05,358400,2550,1020,1390,10.4,474600,3480,1780,1870,8060]
["19 0118",340,172,17,16,25.3,8.3000000000000007,0.48799999999999999,2.0750000000000002,140300,820,280,450,4.1500000000000004,258300,1580,630,860,6.2249999999999996,360400,2270,1050,1230,9.3000000000000007,496100,3160,1790,1690,8490]
["19 0119",340,172,17.3,16.3,26.1,8.8000000000000007,0.50900000000000001,2.2000000000000002,158700,900,290,490,4.4000000000000004,290800,1720,660,940,6.6,403900,2460,1110,1330,9.8000000000000007,550500,3410,1900,1820,8640]
["19 0120",340,172,18,16.899999999999999,26,8,0.44400000000000001,2,156400,820,310,450,4,291000,1580,680,860,6,409800,2280,1110,1230,9.1,577300,3230,1910,1720,8960]
["19 0121",340,172,20,18.7,28,8,0.4,2,209500,900,360,490,4,393500,1730,790,940,6,558900,2500,1280,1340,9.3000000000000007,809800,3630,2230,1920,9920]
["19 0122",340,172,22,20.6,28,6,0.27300000000000002,1.5,195500,690,360,370,3,377900,1330,760,710,4.5,550600,1950,1190,1030,7.4,869300,3020,2130,1590,10900]
["19 0123",360,182,15.5,14.6,23.5,8,0.51600000000000001,2,93000,650,210,360,4,170000,1250,480,680,6,235700,1800,800,970,8.9,320300,2480,1370,1330,8680]
["19 0124",360,182,20,18.8,28.3,8.3000000000000007,0.41499999999999998,2.0750000000000002,194800,830,330,450,4.1500000000000004,365200,1600,730,870,6.2249999999999996,518000,2310,1180,1240,9.4,739800,3310,2020,1750,11200]
["19 0125",360,182,21,19.7,28,7,0.33300000000000002,1.75,182000,700,330,380,3.5,347500,1370,700,730,5.25,501000,1980,1120,1060,8.3000000000000007,752700,2950,1960,1560,11700]
["19 0126",360,182,21.5,20.2,29.5,8,0.372,2,227700,840,370,460,4,431200,1630,790,880,6,617000,2350,1270,1260,9.3000000000000007,902900,3430,2190,1810,12000]
["19 0127",360,182,23,21.6,30.2,7.2,0.313,1.8,243300,780,380,420,3.6,466700,1520,810,810,5.4,675700,2210,1290,1180,8.6,1027000,3320,2250,1750,12800]
["19 0128",370,202,25,23.2,31.4,6.4,0.25600000000000001,1.6,271200,710,370,410,3.2,525000,1390,780,790,4.8,765700,2030,1220,1160,8.1999999999999993,1252000,3260,2290,1840,13700]
["19 0129",370,202,26,24.2,32.799999999999997,6.8,0.26200000000000001,1.7,324500,790,410,450,3.4,628000,1530,860,880,5.0999999999999996,915500,2240,1350,1270,8.6,1480000,3550,2490,2010,14300]
["19 0130",380,152,19,18,29,10,0.52600000000000002,2.5,174600,920,310,410,5,319100,1760,710,780,7.5,442400,2520,1180,1100,11,596100,3460,1960,1490,13500]
["19 0131",380,192,13.5,12.7,26.2,12.7,0.94099999999999995,3.1749999999999998,120300,990,70,560,6.35,196600,1850,260,1040,9.5250000000000004,242400,2600,570,1440,13.5,277600,3350,1130,1840,8420]
["19 0132",380,192,25,23.4,33,8,0.32,2,313100,860,410,460,4,599300,1660,870,890,6,865600,2410,1380,1290,9.6,1318000,3640,2440,1910,15500]
["19 0133",380,202,12,11.5,25,13,1.083,3.25,98100,940,20,560,6.5,156300,1760,170,1040,9.75,187300,2450,440,1430,13.5,205700,3100,920,1780,7350]
["19 0134",380,202,15,14.1,27,12,0.8,3,144400,990,130,580,6,244600,1860,380,1080,9,313900,2630,7301,1510,12.9,379900,3450,1360,1960,9000]
["19 0135",380,212,18,16.7,27,9,0.5,2.25,158000,790,240,480,4.5,288300,1520,540,910,6.75,398700,2180,920,1290,10.3,551200,3070,1650,1800,10200]
["19 0136",400,202,10,9.6,22,12,1.2,3,50100,680,10,390,6,77900,1260,70,710,9,90400,1750,250,980,12.4,95200,2190,560,1210,7050]
["19 0137",400,202,12,11.3,26.5,14.5,1.208,3.625,107500,1000,40,570,7.25,165400,1860,50,1060,10.875,189200,2580,290,1450,15.2,194700,3250,760,1800,8300]
["19 0138",400,202,14,13.2,27,13,0.92900000000000005,3.25,122400,940,70,530,6.5,200800,1760,260,990,9.75,248900,2470,560,1370,13.8,286700,3190,1100,1750,9700]
["19 0139",400,202,16,15.1,28,12,0.75,3,146600,920,160,510,6,252100,1735,410,960,9,328800,2450,770,1350,12.9,406200,3240,1390,1750,11100]
["19 0140",400,202,19,17.899999999999999,30,11,0.57899999999999996,2.75,198900,920,260,510,5.5,357700,1760,600,960,8.25,488200,2510,1020,1360,12.1,645800,3420,1760,1830,13200]
["19 0141",400,202,20.3,19.100000000000001,31.1,10.8,0.53200000000000003,2.7,230900,950,290,520,5.4,420300,1810,670,990,8.1,580100,2590,1120,1400,12,783300,3570,1930,1910,14000]
["19 0142",400,202,21.2,19.899999999999999,31.4,10.199999999999999,0.48099999999999998,2.5499999999999998,240700,910,310,500,5.0999999999999996,443500,1750,700,950,7.65,619200,2510,1160,1360,11.5,857100,3520,2000,1880,14600]
["19 0143",400,202,22.5,21.2,32.5,10,0.44400000000000001,2.5,274900,930,350,500,5,512000,1780,770,960,7.5,722000,2560,1270,1380,11.3,1014000,3610,2150,1920,15600]
["19 0144",400,202,30,28.2,37.200000000000003,7.2,0.24,1.8,422500,790,450,420,3.6,822700,1540,930,820,5.4,1206000,2250,1460,1190,9,1945000,3570,2620,1860,20700]
["19 0145",440,212,18.5,null,32,13.5,0.73,3.375,190400,910,250,480,6.75,338500,1720,600,900,10.125,458400,2440,1040,1270,13.5,564300,3060,1570,1570,17000]
["19 0146",440,252,25,23.2,33,8,0.32,2,257500,670,300,400,4,491700,1290,640,780,6,708500,1870,1030,1120,9.8000000000000007,1094000,2870,1870,1700,18600]
["19 0147",450,202,25.5,24,34.1,8.6,0.33700000000000002,2.15,241500,670,320,330,4.3,461200,1300,690,630,6.45,665000,1890,1090,900,10.1,991000,2800,1880,1320,23900]
["19 0148",450,252,21,19.5,33,12,0.57099999999999995,3,251200,910,230,550,6,449800,1740,540,1050,9,610900,2480,940,1480,13.5,814900,3430,1700,2030,16700]
["19 0149",450,252,25,23.3,33.799999999999997,8.8000000000000007,0.35199999999999998,2.2000000000000002,269500,700,300,420,4.4000000000000004,511400,1360,650,800,6.6,733000,1970,1050,1160,10.5,1099000,2940,1870,1710,20000]
["19 0150",470,237,33,31,42,9,0.27300000000000002,2.25,516100,800,430,430,4.5,999000,1560,900,830,6.75,1456000,2290,1410,1210,11,2282000,3520,2490,1840,31500]
["19 0151",480,252,20.3,19,33,12.7,0.626,3.1749999999999998,207400,820,190,470,6.35,367200,1560,460,890,9.5250000000000004,493500,2220,810,1250,14,641300,3010,1440,1680,19600]
["19 0152",480,252,20.7,null,36.6,15.9,0.76800000000000002,3.9750000000000001,285500,1030,260,590,7.95,502600,1950,630,1110,11.925000000000001,674300,2760,1100,1550,15.9,823100,3460,1690,1930,21300]
["19 0153",500,202,37,35,44.4,7.4,0.2,1.85,466200,630,400,270,3.7,914900,1240,830,530,5.55,1350000,1820,1280,770,9.4,2233000,2950,2310,1240,45100]
["19 0154",500,242,32,30,41,9,0.28100000000000003,2.25,408400,690,360,360,4.5,788400,1350,760,690,6.75,1147000,1960,1200,1000,11,1794000,3030,2120,1520,35400]
["19 0155",500,252,19,null,34.5,15.5,0.81599999999999995,3.875,200100,860,190,480,7.75,348100,1630,480,900,11.625,461300,2310,870,1250,15.5,557200,2880,1350,1550,21900]
["19 0156",600,282,22,null,44,22,1,5.5,340100,1070,140,560,11,564800,2000,420,1050,16.5,712400,2810,8201,1450,22,821500,3480,1360,1780,38000]
["19 0157",600,282,24,null,46,22,0.91700000000000004,5.5,413600,1120,200,590,11,701300,2110,530,1100,16.5,905000,2970,990,1530,22,1066000,3700,1580,1880,41500]